{"text_format":"1","workbook":"xlsx","n_sheets":3,"sheets":["Anrechnung erbrachter Leistung","Studiengänge","Begründung"],"not_rendered":{"charts":0,"images":2,"macros":1,"external_links":0,"defined_names":4,"comments":0,"pivot_tables":0},"unopened":[],"bounds":{"document_bytes":16777216,"sheet_cells":100000,"rows_first":2000,"rows_last":500,"rows_between":2000,"halvings":0,"cell_chars":16384,"cell_head_chars":4096},"cells_cut":0,"cells_raw":0,"read":"whole","date_system":"1900"}

{"sheet":"Anrechnung erbrachter Leistung","index":0,"n_rows":47,"n_cols":18,"rows_kept":47,"cut":false,"hidden":false,"merged":[[16,5,16,7],[5,1,6,6],[39,1,41,15],[46,1,49,15],[17,11,17,13],[16,11,16,15],[5,9,6,12],[7,9,8,12],[9,9,10,12],[5,13,6,15],[7,13,8,15],[9,13,10,15],[16,2,17,2],[1,4,4,7],[8,1,8,4],[1,9,2,12],[3,9,4,12],[1,13,2,15],[3,13,4,15]]}
[]
[null,null,null,null,"                             FH Münster\n                             FB Physikingenieurwesen\n                             Prüfungsamt\n                             Stegerwaldstraße 39\n                             48565 Steinfurt",null,null,null,null,"Name, Vorname:"]
[]
[null,null,null,null,null,null,null,null,null,"Martrikelnummer:"]
[]
[null,"Anrechnung von erbrachten Studienleistungen im Studiengang",null,null,null,null,null,null,null,"Straße:"]
[]
[null," - bitte drop-down Menü anklicken um den Studiengang zu wählen",null,null,null,null,null,null,null,"PLZ/Ort:"]
[null,"Wirtschaftsingenieurwesen Biomedizinische Technik"]
[null,"Hiermit bitte ich um Anerkennung der nachfolgend aufgelisteten Leistungen.\t",null,null,null,null,null,null,null,"E-Mail:"]
[]
[]
[null,"Datum",null,"Unterschrift"]
[]
[null,"Vorlesung [V], Übung [Ü], Praktikum[P], Modulprüfung [MP], Hausarbeit [HA], Kombiprüfung [KP]"]
[]
[null,"Prüfungsnr.","Modul des \nStudiengangs\n(zu erbringende Leistung)","CP","Anerkennung wird beantragt durch erbrachte Leistung im Modul/Fach:","SWS",null,null,"CP","Art/\nPrfg","Note","Nicht vom Studierenden auszufüllen"]
[null,null,null,null,null,null,null,null,null,null,null,"Leistung kann anerkannt werden",null,null,"Bei\nbenoteten Leistungen","Unterschrift der/des zuständigen Lehrenden"]
[null,null,"Modulauswahl über drop-down Menü",null,null,"V","Ü","P",null,null,null,"ja","nein","teilw.","Note",{"$f":"IFERROR(VLOOKUP(Q19,Studiengänge!$D$5:$F$32,2),\"\")","v":""},null,{"$f":"IFERROR(VLOOKUP(Q19,Studiengänge!$D$5:$F$32,3),\"\")","v":""}]
[null,{"$f":"IFERROR(VLOOKUP($C20,Studiengänge!$D$6:$F$85,2,0),\"\")","v":""},null,{"$f":"IFERROR(VLOOKUP($C20,Studiengänge!$D$6:$F$85,3,0),\"\")","v":""},null,null,null,null,null,null,null,null,null,null,null,{"$f":"IFERROR(VLOOKUP(Q20,Studiengänge!$D$5:$F$32,2),\"\")","v":""},null,{"$f":"IFERROR(VLOOKUP(Q20,Studiengänge!$D$5:$F$32,3),\"\")","v":""}]
[null,{"$f":"IFERROR(VLOOKUP($C21,Studiengänge!$D$6:$F$85,2,0),\"\")","v":""},null,{"$f":"IFERROR(VLOOKUP($C21,Studiengänge!$D$6:$F$85,3,0),\"\")","v":""},null,null,null,null,null,null,null,null,null,null,null,{"$f":"IFERROR(VLOOKUP(Q21,Studiengänge!$D$5:$F$32,2),\"\")","v":""},null,{"$f":"IFERROR(VLOOKUP(Q21,Studiengänge!$D$5:$F$32,3),\"\")","v":""}]
[null,{"$f":"IFERROR(VLOOKUP($C22,Studiengänge!$D$6:$F$85,2,0),\"\")","v":""},null,{"$f":"IFERROR(VLOOKUP($C22,Studiengänge!$D$6:$F$85,3,0),\"\")","v":""},null,null,null,null,null,null,null,null,null,null,null,{"$f":"IFERROR(VLOOKUP(Q22,Studiengänge!$D$5:$F$32,2),\"\")","v":""},null,{"$f":"IFERROR(VLOOKUP(Q22,Studiengänge!$D$5:$F$32,3),\"\")","v":""}]
[null,{"$f":"IFERROR(VLOOKUP($C23,Studiengänge!$D$6:$F$85,2,0),\"\")","v":""},null,{"$f":"IFERROR(VLOOKUP($C23,Studiengänge!$D$6:$F$85,3,0),\"\")","v":""},null,null,null,null,null,null,null,null,null,null,null,{"$f":"IFERROR(VLOOKUP(Q23,Studiengänge!$D$5:$F$32,2),\"\")","v":""},null,{"$f":"IFERROR(VLOOKUP(Q23,Studiengänge!$D$5:$F$32,3),\"\")","v":""}]
[null,{"$f":"IFERROR(VLOOKUP($C24,Studiengänge!$D$6:$F$85,2,0),\"\")","v":""},null,{"$f":"IFERROR(VLOOKUP($C24,Studiengänge!$D$6:$F$85,3,0),\"\")","v":""},null,null,null,null,null,null,null,null,null,null,null,{"$f":"IFERROR(VLOOKUP(Q24,Studiengänge!$D$5:$F$32,2),\"\")","v":""},null,{"$f":"IFERROR(VLOOKUP(Q24,Studiengänge!$D$5:$F$32,3),\"\")","v":""}]
[null,{"$f":"IFERROR(VLOOKUP($C25,Studiengänge!$D$6:$F$85,2,0),\"\")","v":""},null,{"$f":"IFERROR(VLOOKUP($C25,Studiengänge!$D$6:$F$85,3,0),\"\")","v":""},null,null,null,null,null,null,null,null,null,null,null,{"$f":"IFERROR(VLOOKUP(Q25,Studiengänge!$D$5:$F$32,2),\"\")","v":""},null,{"$f":"IFERROR(VLOOKUP(Q25,Studiengänge!$D$5:$F$32,3),\"\")","v":""}]
[null,{"$f":"IFERROR(VLOOKUP($C26,Studiengänge!$D$6:$F$85,2,0),\"\")","v":""},null,{"$f":"IFERROR(VLOOKUP($C26,Studiengänge!$D$6:$F$85,3,0),\"\")","v":""},null,null,null,null,null,null,null,null,null,null,null,{"$f":"IFERROR(VLOOKUP(Q26,Studiengänge!$D$5:$F$32,2),\"\")","v":""},null,{"$f":"IFERROR(VLOOKUP(Q26,Studiengänge!$D$5:$F$32,3),\"\")","v":""}]
[null,{"$f":"IFERROR(VLOOKUP($C27,Studiengänge!$D$6:$F$85,2,0),\"\")","v":""},null,{"$f":"IFERROR(VLOOKUP($C27,Studiengänge!$D$6:$F$85,3,0),\"\")","v":""},null,null,null,null,null,null,null,null,null,null,null,{"$f":"IFERROR(VLOOKUP(Q27,Studiengänge!$D$5:$F$32,2),\"\")","v":""},null,{"$f":"IFERROR(VLOOKUP(Q27,Studiengänge!$D$5:$F$32,3),\"\")","v":""}]
[null,{"$f":"IFERROR(VLOOKUP($C28,Studiengänge!$D$6:$F$85,2,0),\"\")","v":""},null,{"$f":"IFERROR(VLOOKUP($C28,Studiengänge!$D$6:$F$85,3,0),\"\")","v":""},null,null,null,null,null,null,null,null,null,null,null,{"$f":"IFERROR(VLOOKUP(Q28,Studiengänge!$D$5:$F$32,2),\"\")","v":""},null,{"$f":"IFERROR(VLOOKUP(Q28,Studiengänge!$D$5:$F$32,3),\"\")","v":""}]
[null,{"$f":"IFERROR(VLOOKUP($C29,Studiengänge!$D$6:$F$85,2,0),\"\")","v":""},null,{"$f":"IFERROR(VLOOKUP($C29,Studiengänge!$D$6:$F$85,3,0),\"\")","v":""}]
[null,{"$f":"IFERROR(VLOOKUP($C30,Studiengänge!$D$6:$F$85,2,0),\"\")","v":""},null,{"$f":"IFERROR(VLOOKUP($C30,Studiengänge!$D$6:$F$85,3,0),\"\")","v":""}]
[null,{"$f":"IFERROR(VLOOKUP($C31,Studiengänge!$D$6:$F$85,2,0),\"\")","v":""},null,{"$f":"IFERROR(VLOOKUP($C31,Studiengänge!$D$6:$F$85,3,0),\"\")","v":""}]
[null,{"$f":"IFERROR(VLOOKUP($C32,Studiengänge!$D$6:$F$85,2,0),\"\")","v":""},null,{"$f":"IFERROR(VLOOKUP($C32,Studiengänge!$D$6:$F$85,3,0),\"\")","v":""}]
[null,{"$f":"IFERROR(VLOOKUP($C33,Studiengänge!$D$6:$F$85,2,0),\"\")","v":""},null,{"$f":"IFERROR(VLOOKUP($C33,Studiengänge!$D$6:$F$85,3,0),\"\")","v":""}]
[null,{"$f":"IFERROR(VLOOKUP($C34,Studiengänge!$D$6:$F$85,2,0),\"\")","v":""},null,{"$f":"IFERROR(VLOOKUP($C34,Studiengänge!$D$6:$F$85,3,0),\"\")","v":""}]
[null,{"$f":"IFERROR(VLOOKUP($C35,Studiengänge!$D$6:$F$85,2,0),\"\")","v":""},null,{"$f":"IFERROR(VLOOKUP($C35,Studiengänge!$D$6:$F$85,3,0),\"\")","v":""}]
[null,{"$f":"IFERROR(VLOOKUP($C36,Studiengänge!$D$6:$F$85,2,0),\"\")","v":""},null,{"$f":"IFERROR(VLOOKUP($C36,Studiengänge!$D$6:$F$85,3,0),\"\")","v":""}]
[null,{"$f":"IFERROR(VLOOKUP($C37,Studiengänge!$D$6:$F$85,2,0),\"\")","v":""},null,{"$f":"IFERROR(VLOOKUP($C37,Studiengänge!$D$6:$F$85,3,0),\"\")","v":""}]
[null,{"$f":"IFERROR(VLOOKUP($C38,Studiengänge!$D$6:$F$85,2,0),\"\")","v":""},null,{"$f":"IFERROR(VLOOKUP($C38,Studiengänge!$D$6:$F$85,3,0),\"\")","v":""}]
[null,{"$f":"IFERROR(VLOOKUP($C39,Studiengänge!$D$6:$F$85,2,0),\"\")","v":""},null,{"$f":"IFERROR(VLOOKUP($C39,Studiengänge!$D$6:$F$85,3,0),\"\")","v":""}]
[null,"Die Anerkennung erfolgt entsprechend obiger Aufstellung\n                                                                                                                                                     \n                                                                                                     "]
[]
[]
[]
[]
[null,"Datum",null,"Prüfungsausschussvorsitzender-/beauftragter"]
[]
[null,"Fügen Sie als Anlage Ihre Notenübersicht mit der Ergänzung der Noten in Ziffern mit einer Nachkommastelle und Angabe der ECTS Punkte sowie sämtlichen bestandenen Leistungen Ihres bisherigen Studiengangs bei. Außerdem benötigen wir die Modulbeschreibungen der beantragten Module Ihrer Hochschule. Ohne diese Unterlagen ist keine Bearbeitung möglich. Dieses Formular geben Sie im Prüfungsamt des FB Physikingenieurwesen ab oder schicken es per Mail (pruefungsamt-phy@fh-muenster.de) oder per Post (Adresse s. o.) zurück. "]

{"sheet":"Studiengänge","index":1,"n_rows":85,"n_cols":52,"rows_kept":85,"cut":false,"hidden":true,"merged":[[0,1,0,5],[2,17,2,19],[2,25,2,27],[2,21,2,23],[2,9,2,11],[2,13,2,15],[1,3,1,5],[2,37,2,39],[2,41,2,43],[2,45,2,47],[2,49,2,51],[2,29,2,31],[2,33,2,35]]}
[null,"Arbeitslisten"]
[null,null,null,"Auswahl Liste",null,null,null,null,null,"FB Physikingenieurwesen"]
[null,"Studiengänge",null,null,null,null,null,null,null,"B.Sc. Biomedizinische Technik",null,null,null,"B.Sc. Physikalische Technologien und Lasertechnik",null,null,null,"B.Eng. Technische Orthopädie",null,null,null,"Wirtschaftsingenieurwesen Biomedizinische Technik",null,null,null,"Wirtschaftsingenieurwesen Physikalische Technologien und Lasertechnik",null,null,null,"M.Sc. Biomedizinische Technik",null,null,null,"M.Sc. Photonics"]
[null,null,"Nr.","Modul","Prüfungsnr.:","CP",null,null,"Nr.","Prüfungsnr.:","Modul","CP",null,"Prüfungsnr.:","Modul","CP",null,"Prüfungsnr.:","Modul","CP",null,"Prüfungsnr.:","Modul","CP",null,"Prüfungsnr.:","Modul","CP",null,"Prüfungsnr.:","Modul","CP",null,"Prüfungsnr.:","Modul","CP",null,"Prüfungsnr.:","Modul","CP",null,"Prüfungsnr.:","Modul","CP",null,"Prüfungsnr.:","Modul","CP",null,"Prüfungsnr.:","Modul","CP"]
[null,null,0,null,null,null,null,null,0]
[null,{"$f":"IF(ISBLANK(INDEX($J$3:$XFD$3,1+C6*4-4)),\"\",INDEX($J$3:$XFD$3,1+C6*4-4))","v":"B.Sc. Biomedizinische Technik"},1,{"$f":"IFERROR(IF(INDEX($J$6:$XFD$85,C6,MATCH('Anrechnung erbrachter Leistung'!$B$9,$J$3:$XFD$3,)+1)=0,\"\",IFERROR(INDEX($J$6:$XFD$85,C6,MATCH('Anrechnung erbrachter Leistung'!$B$9,$J$3:$XFD$3,)+1),\"\")),\"\")","v":"Allgemeine Betriebswirtschaftslehre"},{"$f":"IFERROR(IF(INDEX($J$6:$XFD$85,C6,MATCH('Anrechnung erbrachter Leistung'!$B$9,$J$3:$XFD$3,)+0)=0,\"\",IFERROR(INDEX($J$6:$XFD$85,C6,MATCH('Anrechnung erbrachter Leistung'!$B$9,$J$3:$XFD$3,)+0),\"\")),\"\")","v":""},{"$f":"IFERROR(IF(ISBLANK(INDEX($J$6:$XFD$85,C6,MATCH('Anrechnung erbrachter Leistung'!$B$9,$J$3:$XFD$3,)+2)),\"\",IFERROR(INDEX($J$6:$XFD$85,C6,MATCH('Anrechnung erbrachter Leistung'!$B$9,$J$3:$XFD$3,)+2),\"\")),\"\")","v":6},null,null,1,null,"Angewandte Informatik in den Ingenieurwissenschaften",5,null,null,"Angewandte Informatik in den Ingenieurwissenschaften",5,null,null,"Angewandte Informatik in den Ingenieurwissenschaften",5,null,null,"Allgemeine Betriebswirtschaftslehre",6,null,null,"Allgemeine Betriebswirtschaftslehre",6,null,null,"Biomedizinische Bildgebung",5,null,null,"Image processing",6]
[null,"B.Sc. Physikalische Technologien und Lasertechnik",2,{"$f":"IFERROR(IF(INDEX($J$6:$XFD$85,C7,MATCH('Anrechnung erbrachter Leistung'!$B$9,$J$3:$XFD$3,)+1)=0,\"\",IFERROR(INDEX($J$6:$XFD$85,C7,MATCH('Anrechnung erbrachter Leistung'!$B$9,$J$3:$XFD$3,)+1),\"\")),\"\")","v":"Finanzierung und Controlling"},{"$f":"IFERROR(IF(INDEX($J$6:$XFD$85,C7,MATCH('Anrechnung erbrachter Leistung'!$B$9,$J$3:$XFD$3,)+0)=0,\"\",IFERROR(INDEX($J$6:$XFD$85,C7,MATCH('Anrechnung erbrachter Leistung'!$B$9,$J$3:$XFD$3,)+0),\"\")),\"\")","v":""},{"$f":"IFERROR(IF(ISBLANK(INDEX($J$6:$XFD$85,C7,MATCH('Anrechnung erbrachter Leistung'!$B$9,$J$3:$XFD$3,)+2)),\"\",IFERROR(INDEX($J$6:$XFD$85,C7,MATCH('Anrechnung erbrachter Leistung'!$B$9,$J$3:$XFD$3,)+2),\"\")),\"\")","v":6},null,null,2,null,"Angewandte Steuerungs- und Regelungstechnik",5,null,null,"Angewandte Steuerungs- und Regelungstechnik",5,null,null,"Einführung in das wiss. Arbeiten, Präsentieren, Publizieren",5,null,null,"Finanzierung und Controlling",6,null,null,"Finanzierung und Controlling",6,null,null,"Biomedizinische Bildverarbeitung",5,null,null,"Laser physics",6]
[null,"B.Eng. Technische Orthopädie",3,{"$f":"IFERROR(IF(INDEX($J$6:$XFD$85,C8,MATCH('Anrechnung erbrachter Leistung'!$B$9,$J$3:$XFD$3,)+1)=0,\"\",IFERROR(INDEX($J$6:$XFD$85,C8,MATCH('Anrechnung erbrachter Leistung'!$B$9,$J$3:$XFD$3,)+1),\"\")),\"\")","v":"Produktionswirtschaftliche Anwendungen"},{"$f":"IFERROR(IF(INDEX($J$6:$XFD$85,C8,MATCH('Anrechnung erbrachter Leistung'!$B$9,$J$3:$XFD$3,)+0)=0,\"\",IFERROR(INDEX($J$6:$XFD$85,C8,MATCH('Anrechnung erbrachter Leistung'!$B$9,$J$3:$XFD$3,)+0),\"\")),\"\")","v":""},{"$f":"IFERROR(IF(ISBLANK(INDEX($J$6:$XFD$85,C8,MATCH('Anrechnung erbrachter Leistung'!$B$9,$J$3:$XFD$3,)+2)),\"\",IFERROR(INDEX($J$6:$XFD$85,C8,MATCH('Anrechnung erbrachter Leistung'!$B$9,$J$3:$XFD$3,)+2),\"\")),\"\")","v":6},null,null,3,null,"Biophysik",5,null,null,"Chemie für Ingenieure",5,null,null,"Grundlagen der Betriebswirtschaftslehre",5,null,null,"Produktionswirtschaftliche Anwendungen",6,null,null,"Produktionswirtschaftliche Anwendungen",6,null,null,"Biomedical Materials",5,null,null,"Integrated Devices",6]
[null,"Wirtschaftsingenieurwesen Biomedizinische Technik",4,{"$f":"IFERROR(IF(INDEX($J$6:$XFD$85,C9,MATCH('Anrechnung erbrachter Leistung'!$B$9,$J$3:$XFD$3,)+1)=0,\"\",IFERROR(INDEX($J$6:$XFD$85,C9,MATCH('Anrechnung erbrachter Leistung'!$B$9,$J$3:$XFD$3,)+1),\"\")),\"\")","v":"Marketing"},{"$f":"IFERROR(IF(INDEX($J$6:$XFD$85,C9,MATCH('Anrechnung erbrachter Leistung'!$B$9,$J$3:$XFD$3,)+0)=0,\"\",IFERROR(INDEX($J$6:$XFD$85,C9,MATCH('Anrechnung erbrachter Leistung'!$B$9,$J$3:$XFD$3,)+0),\"\")),\"\")","v":""},{"$f":"IFERROR(IF(ISBLANK(INDEX($J$6:$XFD$85,C9,MATCH('Anrechnung erbrachter Leistung'!$B$9,$J$3:$XFD$3,)+2)),\"\",IFERROR(INDEX($J$6:$XFD$85,C9,MATCH('Anrechnung erbrachter Leistung'!$B$9,$J$3:$XFD$3,)+2),\"\")),\"\")","v":6},null,null,4,null,"Biosignale",5,null,null,"Einf. In die Finite-Elemente-Methode",5,null,null,"Grundlagen der Elektrotechnik",10,null,null,"Marketing",6,null,null,"Marketing",6,null,null,"Biomedizinische Sensortechnik und Messtechnik",5,null,null,"Theoretical optics",6]
[null,"Wirtschaftsingenieurwesen Physikalische Technologien und Lasertechnik",5,{"$f":"IFERROR(IF(INDEX($J$6:$XFD$85,C10,MATCH('Anrechnung erbrachter Leistung'!$B$9,$J$3:$XFD$3,)+1)=0,\"\",IFERROR(INDEX($J$6:$XFD$85,C10,MATCH('Anrechnung erbrachter Leistung'!$B$9,$J$3:$XFD$3,)+1),\"\")),\"\")","v":"Wirtschaftsenglich"},{"$f":"IFERROR(IF(INDEX($J$6:$XFD$85,C10,MATCH('Anrechnung erbrachter Leistung'!$B$9,$J$3:$XFD$3,)+0)=0,\"\",IFERROR(INDEX($J$6:$XFD$85,C10,MATCH('Anrechnung erbrachter Leistung'!$B$9,$J$3:$XFD$3,)+0),\"\")),\"\")","v":""},{"$f":"IFERROR(IF(ISBLANK(INDEX($J$6:$XFD$85,C10,MATCH('Anrechnung erbrachter Leistung'!$B$9,$J$3:$XFD$3,)+2)),\"\",IFERROR(INDEX($J$6:$XFD$85,C10,MATCH('Anrechnung erbrachter Leistung'!$B$9,$J$3:$XFD$3,)+2),\"\")),\"\")","v":5},null,null,5,null,"Chemie für Ingenieure",5,null,null,"Grundlagen der Elektrotechnik",10,null,null,"Grundlagen der Programmierung",5,null,null,"Wirtschaftsenglich",5,null,null,"Wirtschaftsenglich",5,null,null,"Biowissenschaftliche Statistik",5,null,null,"Development of Optical Systems",6]
[null,"M.Sc. Biomedizinische Technik",6,{"$f":"IFERROR(IF(INDEX($J$6:$XFD$85,C11,MATCH('Anrechnung erbrachter Leistung'!$B$9,$J$3:$XFD$3,)+1)=0,\"\",IFERROR(INDEX($J$6:$XFD$85,C11,MATCH('Anrechnung erbrachter Leistung'!$B$9,$J$3:$XFD$3,)+1),\"\")),\"\")","v":"Unternehmensführung"},{"$f":"IFERROR(IF(INDEX($J$6:$XFD$85,C11,MATCH('Anrechnung erbrachter Leistung'!$B$9,$J$3:$XFD$3,)+0)=0,\"\",IFERROR(INDEX($J$6:$XFD$85,C11,MATCH('Anrechnung erbrachter Leistung'!$B$9,$J$3:$XFD$3,)+0),\"\")),\"\")","v":""},{"$f":"IFERROR(IF(ISBLANK(INDEX($J$6:$XFD$85,C11,MATCH('Anrechnung erbrachter Leistung'!$B$9,$J$3:$XFD$3,)+2)),\"\",IFERROR(INDEX($J$6:$XFD$85,C11,MATCH('Anrechnung erbrachter Leistung'!$B$9,$J$3:$XFD$3,)+2),\"\")),\"\")","v":6},null,null,6,null,"Einf. in das wiss. Arbeiten, Präsentieren, Publizieren",5,null,null,"Grundlagen der Lasertechnik",5,null,null,"Klinische Biomechanik",10,null,null,"Unternehmensführung",6,null,null,"Unternehmensführung",6,null,null,"Diagnostik und Therapie",5,null,null,"Laser Metrology",6]
[null,"M.Sc. Photonics",7,{"$f":"IFERROR(IF(INDEX($J$6:$XFD$85,C12,MATCH('Anrechnung erbrachter Leistung'!$B$9,$J$3:$XFD$3,)+1)=0,\"\",IFERROR(INDEX($J$6:$XFD$85,C12,MATCH('Anrechnung erbrachter Leistung'!$B$9,$J$3:$XFD$3,)+1),\"\")),\"\")","v":"Angewandte Informatik in den Ingenieurwissenschaften"},{"$f":"IFERROR(IF(INDEX($J$6:$XFD$85,C12,MATCH('Anrechnung erbrachter Leistung'!$B$9,$J$3:$XFD$3,)+0)=0,\"\",IFERROR(INDEX($J$6:$XFD$85,C12,MATCH('Anrechnung erbrachter Leistung'!$B$9,$J$3:$XFD$3,)+0),\"\")),\"\")","v":""},{"$f":"IFERROR(IF(ISBLANK(INDEX($J$6:$XFD$85,C12,MATCH('Anrechnung erbrachter Leistung'!$B$9,$J$3:$XFD$3,)+2)),\"\",IFERROR(INDEX($J$6:$XFD$85,C12,MATCH('Anrechnung erbrachter Leistung'!$B$9,$J$3:$XFD$3,)+2),\"\")),\"\")","v":5},null,null,7,null,"Grundlagen der Elektrotechnik",10,null,null,"Grundlagen der Programmierung",5,null,null,"Klinische Fachkunde",5,null,null,"Angewandte Informatik in den Ingenieurwissenschaften",5,null,null,"Angewandte Informatik in den Ingenieurwissenschaften",5,null,null,"Human Factors Engineering I",5,null,null,"Quantum Sensors",6]
[null,"",8,{"$f":"IFERROR(IF(INDEX($J$6:$XFD$85,C13,MATCH('Anrechnung erbrachter Leistung'!$B$9,$J$3:$XFD$3,)+1)=0,\"\",IFERROR(INDEX($J$6:$XFD$85,C13,MATCH('Anrechnung erbrachter Leistung'!$B$9,$J$3:$XFD$3,)+1),\"\")),\"\")","v":"Grundlagen der Elektrotechnik"},{"$f":"IFERROR(IF(INDEX($J$6:$XFD$85,C13,MATCH('Anrechnung erbrachter Leistung'!$B$9,$J$3:$XFD$3,)+0)=0,\"\",IFERROR(INDEX($J$6:$XFD$85,C13,MATCH('Anrechnung erbrachter Leistung'!$B$9,$J$3:$XFD$3,)+0),\"\")),\"\")","v":""},{"$f":"IFERROR(IF(ISBLANK(INDEX($J$6:$XFD$85,C13,MATCH('Anrechnung erbrachter Leistung'!$B$9,$J$3:$XFD$3,)+2)),\"\",IFERROR(INDEX($J$6:$XFD$85,C13,MATCH('Anrechnung erbrachter Leistung'!$B$9,$J$3:$XFD$3,)+2),\"\")),\"\")","v":10},null,null,8,null,"Grundlagen der Programmierung",5,null,null,"Kunstruktionstechnik und CAD",5,null,null,"Konstruktionstechnik und CAD",5,null,null,"Grundlagen der Elektrotechnik",10,null,null,"Grundlagen der Elektrotechnik",10,null,null,"Projektmanagement",5,null,null,"Wave and Qantum Optics",6]
[null,"",9,{"$f":"IFERROR(IF(INDEX($J$6:$XFD$85,C14,MATCH('Anrechnung erbrachter Leistung'!$B$9,$J$3:$XFD$3,)+1)=0,\"\",IFERROR(INDEX($J$6:$XFD$85,C14,MATCH('Anrechnung erbrachter Leistung'!$B$9,$J$3:$XFD$3,)+1),\"\")),\"\")","v":"Grundlagen der Programmierung"},{"$f":"IFERROR(IF(INDEX($J$6:$XFD$85,C14,MATCH('Anrechnung erbrachter Leistung'!$B$9,$J$3:$XFD$3,)+0)=0,\"\",IFERROR(INDEX($J$6:$XFD$85,C14,MATCH('Anrechnung erbrachter Leistung'!$B$9,$J$3:$XFD$3,)+0),\"\")),\"\")","v":""},{"$f":"IFERROR(IF(ISBLANK(INDEX($J$6:$XFD$85,C14,MATCH('Anrechnung erbrachter Leistung'!$B$9,$J$3:$XFD$3,)+2)),\"\",IFERROR(INDEX($J$6:$XFD$85,C14,MATCH('Anrechnung erbrachter Leistung'!$B$9,$J$3:$XFD$3,)+2),\"\")),\"\")","v":5},null,null,9,null,"Konstruktionstechnik und CAD",5,null,null,"Laseranwendungen",5,null,null,"Konzeptentwicklung TO",10,null,null,"Grundlagen der Programmierung",5,null,null,"Grundlagen in der Programmierung",5,null,null,"Technische Biomechanik I",5,null,null,"Development of Solid State Lasers",6]
[null,"",10,{"$f":"IFERROR(IF(INDEX($J$6:$XFD$85,C15,MATCH('Anrechnung erbrachter Leistung'!$B$9,$J$3:$XFD$3,)+1)=0,\"\",IFERROR(INDEX($J$6:$XFD$85,C15,MATCH('Anrechnung erbrachter Leistung'!$B$9,$J$3:$XFD$3,)+1),\"\")),\"\")","v":"Konstruktionstechnik und CAD"},{"$f":"IFERROR(IF(INDEX($J$6:$XFD$85,C15,MATCH('Anrechnung erbrachter Leistung'!$B$9,$J$3:$XFD$3,)+0)=0,\"\",IFERROR(INDEX($J$6:$XFD$85,C15,MATCH('Anrechnung erbrachter Leistung'!$B$9,$J$3:$XFD$3,)+0),\"\")),\"\")","v":""},{"$f":"IFERROR(IF(ISBLANK(INDEX($J$6:$XFD$85,C15,MATCH('Anrechnung erbrachter Leistung'!$B$9,$J$3:$XFD$3,)+2)),\"\",IFERROR(INDEX($J$6:$XFD$85,C15,MATCH('Anrechnung erbrachter Leistung'!$B$9,$J$3:$XFD$3,)+2),\"\")),\"\")","v":5},null,null,10,null,"Maschinen- und Kontruktionselemente",5,null,null,"Maschinen- und Konstruktionselemente",5,null,null,"Maschinen- und Konstruktionselemente",5,null,null,"Konstruktionstechnik und CAD",5,null,null,"Konstruktionstechnik und CAD",5,null,null,"Human Factors Engineering II",5,null,null,"Laser Material Processing",6]
[null,"",11,{"$f":"IFERROR(IF(INDEX($J$6:$XFD$85,C16,MATCH('Anrechnung erbrachter Leistung'!$B$9,$J$3:$XFD$3,)+1)=0,\"\",IFERROR(INDEX($J$6:$XFD$85,C16,MATCH('Anrechnung erbrachter Leistung'!$B$9,$J$3:$XFD$3,)+1),\"\")),\"\")","v":"Maschinen- und Kontruktionselemente"},{"$f":"IFERROR(IF(INDEX($J$6:$XFD$85,C16,MATCH('Anrechnung erbrachter Leistung'!$B$9,$J$3:$XFD$3,)+0)=0,\"\",IFERROR(INDEX($J$6:$XFD$85,C16,MATCH('Anrechnung erbrachter Leistung'!$B$9,$J$3:$XFD$3,)+0),\"\")),\"\")","v":""},{"$f":"IFERROR(IF(ISBLANK(INDEX($J$6:$XFD$85,C16,MATCH('Anrechnung erbrachter Leistung'!$B$9,$J$3:$XFD$3,)+2)),\"\",IFERROR(INDEX($J$6:$XFD$85,C16,MATCH('Anrechnung erbrachter Leistung'!$B$9,$J$3:$XFD$3,)+2),\"\")),\"\")","v":5},null,null,11,null,"Mathematik",15,null,null,"Mathematik I und Mathematik II",15,null,null,"Mathematik",12,null,null,"Maschinen- und Kontruktionselemente",5,null,null,"Maschinen- und Kontruktionselemente",5,null,null,"Entwicklung, Prüfung und Zulassung von Medizinprodukten",10,null,null,"Optical Measurement Technology",6]
[null,"",12,{"$f":"IFERROR(IF(INDEX($J$6:$XFD$85,C17,MATCH('Anrechnung erbrachter Leistung'!$B$9,$J$3:$XFD$3,)+1)=0,\"\",IFERROR(INDEX($J$6:$XFD$85,C17,MATCH('Anrechnung erbrachter Leistung'!$B$9,$J$3:$XFD$3,)+1),\"\")),\"\")","v":"Mathematik I"},{"$f":"IFERROR(IF(INDEX($J$6:$XFD$85,C17,MATCH('Anrechnung erbrachter Leistung'!$B$9,$J$3:$XFD$3,)+0)=0,\"\",IFERROR(INDEX($J$6:$XFD$85,C17,MATCH('Anrechnung erbrachter Leistung'!$B$9,$J$3:$XFD$3,)+0),\"\")),\"\")","v":""},{"$f":"IFERROR(IF(ISBLANK(INDEX($J$6:$XFD$85,C17,MATCH('Anrechnung erbrachter Leistung'!$B$9,$J$3:$XFD$3,)+2)),\"\",IFERROR(INDEX($J$6:$XFD$85,C17,MATCH('Anrechnung erbrachter Leistung'!$B$9,$J$3:$XFD$3,)+2),\"\")),\"\")","v":6},null,null,12,null,"Medizingerätetechnik",10,null,null,"Mathematik III",5,null,null,"Mess- und Sensortechnik",10,null,null,"Mathematik I",6,null,null,"Mathematik I",6,null,null,"Immunologie",5,null,null,"Chemical Technology of Materials",6]
[null,"",13,{"$f":"IFERROR(IF(INDEX($J$6:$XFD$85,C18,MATCH('Anrechnung erbrachter Leistung'!$B$9,$J$3:$XFD$3,)+1)=0,\"\",IFERROR(INDEX($J$6:$XFD$85,C18,MATCH('Anrechnung erbrachter Leistung'!$B$9,$J$3:$XFD$3,)+1),\"\")),\"\")","v":"Mathematik II und Statistik"},{"$f":"IFERROR(IF(INDEX($J$6:$XFD$85,C18,MATCH('Anrechnung erbrachter Leistung'!$B$9,$J$3:$XFD$3,)+0)=0,\"\",IFERROR(INDEX($J$6:$XFD$85,C18,MATCH('Anrechnung erbrachter Leistung'!$B$9,$J$3:$XFD$3,)+0),\"\")),\"\")","v":""},{"$f":"IFERROR(IF(ISBLANK(INDEX($J$6:$XFD$85,C18,MATCH('Anrechnung erbrachter Leistung'!$B$9,$J$3:$XFD$3,)+2)),\"\",IFERROR(INDEX($J$6:$XFD$85,C18,MATCH('Anrechnung erbrachter Leistung'!$B$9,$J$3:$XFD$3,)+2),\"\")),\"\")","v":9},null,null,13,null,"Medizinische Grundlagen",5,null,null,"Mess- und Sensortechnik",10,null,null,"Messtechnik TO",10,null,null,"Mathematik II und Statistik",9,null,null,"Mathematik II und Statistik",9,null,null,"Labormedizinische Technik und Personalisierte Medizin",10,null,null,"Funktional Materials",6]
[null,"",14,{"$f":"IFERROR(IF(INDEX($J$6:$XFD$85,C19,MATCH('Anrechnung erbrachter Leistung'!$B$9,$J$3:$XFD$3,)+1)=0,\"\",IFERROR(INDEX($J$6:$XFD$85,C19,MATCH('Anrechnung erbrachter Leistung'!$B$9,$J$3:$XFD$3,)+1),\"\")),\"\")","v":"Mess- und Sensortechnik"},{"$f":"IFERROR(IF(INDEX($J$6:$XFD$85,C19,MATCH('Anrechnung erbrachter Leistung'!$B$9,$J$3:$XFD$3,)+0)=0,\"\",IFERROR(INDEX($J$6:$XFD$85,C19,MATCH('Anrechnung erbrachter Leistung'!$B$9,$J$3:$XFD$3,)+0),\"\")),\"\")","v":""},{"$f":"IFERROR(IF(ISBLANK(INDEX($J$6:$XFD$85,C19,MATCH('Anrechnung erbrachter Leistung'!$B$9,$J$3:$XFD$3,)+2)),\"\",IFERROR(INDEX($J$6:$XFD$85,C19,MATCH('Anrechnung erbrachter Leistung'!$B$9,$J$3:$XFD$3,)+2),\"\")),\"\")","v":10},null,null,14,null,"Medizinische Physik",5,null,null,"Physik",15,null,null,"Orthopädische Pathologie",5,null,null,"Mess- und Sensortechnik",10,null,null,"Mess- und Sensortechnik",10,null,null,"Arbeits- und Gesundheitsschutz",5,null,null,"German as a foreign language",3]
[null,"",15,{"$f":"IFERROR(IF(INDEX($J$6:$XFD$85,C20,MATCH('Anrechnung erbrachter Leistung'!$B$9,$J$3:$XFD$3,)+1)=0,\"\",IFERROR(INDEX($J$6:$XFD$85,C20,MATCH('Anrechnung erbrachter Leistung'!$B$9,$J$3:$XFD$3,)+1),\"\")),\"\")","v":"Physik"},{"$f":"IFERROR(IF(INDEX($J$6:$XFD$85,C20,MATCH('Anrechnung erbrachter Leistung'!$B$9,$J$3:$XFD$3,)+0)=0,\"\",IFERROR(INDEX($J$6:$XFD$85,C20,MATCH('Anrechnung erbrachter Leistung'!$B$9,$J$3:$XFD$3,)+0),\"\")),\"\")","v":""},{"$f":"IFERROR(IF(ISBLANK(INDEX($J$6:$XFD$85,C20,MATCH('Anrechnung erbrachter Leistung'!$B$9,$J$3:$XFD$3,)+2)),\"\",IFERROR(INDEX($J$6:$XFD$85,C20,MATCH('Anrechnung erbrachter Leistung'!$B$9,$J$3:$XFD$3,)+2),\"\")),\"\")","v":15},null,null,15,null,"Medizinprodukterecht",5,null,null,"Quantenphysik",5,null,null,"Physik",13,null,null,"Physik",15,null,null,"Physik",15,null,null,"Kardiotechnik",5,null,null,"Incoherent Light Sources",6]
[null,"",16,{"$f":"IFERROR(IF(INDEX($J$6:$XFD$85,C21,MATCH('Anrechnung erbrachter Leistung'!$B$9,$J$3:$XFD$3,)+1)=0,\"\",IFERROR(INDEX($J$6:$XFD$85,C21,MATCH('Anrechnung erbrachter Leistung'!$B$9,$J$3:$XFD$3,)+1),\"\")),\"\")","v":"Technische Mechanik"},{"$f":"IFERROR(IF(INDEX($J$6:$XFD$85,C21,MATCH('Anrechnung erbrachter Leistung'!$B$9,$J$3:$XFD$3,)+0)=0,\"\",IFERROR(INDEX($J$6:$XFD$85,C21,MATCH('Anrechnung erbrachter Leistung'!$B$9,$J$3:$XFD$3,)+0),\"\")),\"\")","v":""},{"$f":"IFERROR(IF(ISBLANK(INDEX($J$6:$XFD$85,C21,MATCH('Anrechnung erbrachter Leistung'!$B$9,$J$3:$XFD$3,)+2)),\"\",IFERROR(INDEX($J$6:$XFD$85,C21,MATCH('Anrechnung erbrachter Leistung'!$B$9,$J$3:$XFD$3,)+2),\"\")),\"\")","v":5},null,null,16,null,"Mess- und Sensortechnik",10,null,null,"Technische Mechanik",5,null,null,"Rehabilitationstechnik",5,null,null,"Technische Mechanik",5,null,null,"Technische Mechanik",5,null,null,"Rehabilitationstechnik",5,null,null,"Intercultural Communication and Competence",3]
[null,"",17,{"$f":"IFERROR(IF(INDEX($J$6:$XFD$85,C22,MATCH('Anrechnung erbrachter Leistung'!$B$9,$J$3:$XFD$3,)+1)=0,\"\",IFERROR(INDEX($J$6:$XFD$85,C22,MATCH('Anrechnung erbrachter Leistung'!$B$9,$J$3:$XFD$3,)+1),\"\")),\"\")","v":"Werkstoff- und Fertigungstechnik"},{"$f":"IFERROR(IF(INDEX($J$6:$XFD$85,C22,MATCH('Anrechnung erbrachter Leistung'!$B$9,$J$3:$XFD$3,)+0)=0,\"\",IFERROR(INDEX($J$6:$XFD$85,C22,MATCH('Anrechnung erbrachter Leistung'!$B$9,$J$3:$XFD$3,)+0),\"\")),\"\")","v":""},{"$f":"IFERROR(IF(ISBLANK(INDEX($J$6:$XFD$85,C22,MATCH('Anrechnung erbrachter Leistung'!$B$9,$J$3:$XFD$3,)+2)),\"\",IFERROR(INDEX($J$6:$XFD$85,C22,MATCH('Anrechnung erbrachter Leistung'!$B$9,$J$3:$XFD$3,)+2),\"\")),\"\")","v":10},null,null,17,null,"Physik",15,null,null,"Technische Optik",10,null,null,"Technische Biomechanik",10,null,null,"Werkstoff- und Fertigungstechnik",10,null,null,"Werkstoff- und Fertigungstechnik",10,null,null,"Biopharmazeutika",5,null,null,"Microscopy and Surface Science",6]
[null,"",18,{"$f":"IFERROR(IF(INDEX($J$6:$XFD$85,C23,MATCH('Anrechnung erbrachter Leistung'!$B$9,$J$3:$XFD$3,)+1)=0,\"\",IFERROR(INDEX($J$6:$XFD$85,C23,MATCH('Anrechnung erbrachter Leistung'!$B$9,$J$3:$XFD$3,)+1),\"\")),\"\")","v":"Vertiefung - Behavioral Economics"},{"$f":"IFERROR(IF(INDEX($J$6:$XFD$85,C23,MATCH('Anrechnung erbrachter Leistung'!$B$9,$J$3:$XFD$3,)+0)=0,\"\",IFERROR(INDEX($J$6:$XFD$85,C23,MATCH('Anrechnung erbrachter Leistung'!$B$9,$J$3:$XFD$3,)+0),\"\")),\"\")","v":""},{"$f":"IFERROR(IF(ISBLANK(INDEX($J$6:$XFD$85,C23,MATCH('Anrechnung erbrachter Leistung'!$B$9,$J$3:$XFD$3,)+2)),\"\",IFERROR(INDEX($J$6:$XFD$85,C23,MATCH('Anrechnung erbrachter Leistung'!$B$9,$J$3:$XFD$3,)+2),\"\")),\"\")","v":5},null,null,18,null,"Technische Mechanik",5,null,null,"Werkstoff- und Fertigungstechnik",10,null,null,"Technische Mechanik",5,null,null,"Vertiefung - Behavioral Economics",5,null,null,"Vertiefung - Behavioral Economics",5,null,null,"Bioverfahrenstechnik",5,null,null,"Modelling and Simulation",6]
[null,"",19,{"$f":"IFERROR(IF(INDEX($J$6:$XFD$85,C24,MATCH('Anrechnung erbrachter Leistung'!$B$9,$J$3:$XFD$3,)+1)=0,\"\",IFERROR(INDEX($J$6:$XFD$85,C24,MATCH('Anrechnung erbrachter Leistung'!$B$9,$J$3:$XFD$3,)+1),\"\")),\"\")","v":"Vertiefung - Einf. in integrierte Informationssysteme"},{"$f":"IFERROR(IF(INDEX($J$6:$XFD$85,C24,MATCH('Anrechnung erbrachter Leistung'!$B$9,$J$3:$XFD$3,)+0)=0,\"\",IFERROR(INDEX($J$6:$XFD$85,C24,MATCH('Anrechnung erbrachter Leistung'!$B$9,$J$3:$XFD$3,)+0),\"\")),\"\")","v":""},{"$f":"IFERROR(IF(ISBLANK(INDEX($J$6:$XFD$85,C24,MATCH('Anrechnung erbrachter Leistung'!$B$9,$J$3:$XFD$3,)+2)),\"\",IFERROR(INDEX($J$6:$XFD$85,C24,MATCH('Anrechnung erbrachter Leistung'!$B$9,$J$3:$XFD$3,)+2),\"\")),\"\")","v":5},null,null,19,null,"Werkstofftechnik",10,null,null,"WP-Modul 1 - Grundlagen der Betriebswirtschaftslehre",5,null,null,"Unternehmenplanspiel TOPSIM",5,null,null,"Vertiefung - Einf. in integrierte Informationssysteme",5,null,null,"Vertiefung - Einf. in integrierte Informationssysteme",5,null,null,"Gentechnik",5,null,null,"Optical Coherence Tomography",6]
[null,"",20,{"$f":"IFERROR(IF(INDEX($J$6:$XFD$85,C25,MATCH('Anrechnung erbrachter Leistung'!$B$9,$J$3:$XFD$3,)+1)=0,\"\",IFERROR(INDEX($J$6:$XFD$85,C25,MATCH('Anrechnung erbrachter Leistung'!$B$9,$J$3:$XFD$3,)+1),\"\")),\"\")","v":"Vertiefung - Grundlagen der digitalen Transformation"},{"$f":"IFERROR(IF(INDEX($J$6:$XFD$85,C25,MATCH('Anrechnung erbrachter Leistung'!$B$9,$J$3:$XFD$3,)+0)=0,\"\",IFERROR(INDEX($J$6:$XFD$85,C25,MATCH('Anrechnung erbrachter Leistung'!$B$9,$J$3:$XFD$3,)+0),\"\")),\"\")","v":""},{"$f":"IFERROR(IF(ISBLANK(INDEX($J$6:$XFD$85,C25,MATCH('Anrechnung erbrachter Leistung'!$B$9,$J$3:$XFD$3,)+2)),\"\",IFERROR(INDEX($J$6:$XFD$85,C25,MATCH('Anrechnung erbrachter Leistung'!$B$9,$J$3:$XFD$3,)+2),\"\")),\"\")","v":5},null,null,20,null,"WP-Modul 1 - Grundlagen der Betriebswirtschaftslehre",5,null,null,"WP-Modul 1 - Projektwerkstatt und wiss. Arbeiten",5,null,null,"Werkstoff- und Fertigungstechnik",10,null,null,"Vertiefung - Grundlagen der digitalen Transformation",5,null,null,"Vertiefung - Grundlagen der digitalen Transformation",5,null,null,"Laser in der Medizin",5,null,null,"Optical Communications",6]
[null,"",21,{"$f":"IFERROR(IF(INDEX($J$6:$XFD$85,C26,MATCH('Anrechnung erbrachter Leistung'!$B$9,$J$3:$XFD$3,)+1)=0,\"\",IFERROR(INDEX($J$6:$XFD$85,C26,MATCH('Anrechnung erbrachter Leistung'!$B$9,$J$3:$XFD$3,)+1),\"\")),\"\")","v":"Vertiefung - Grundlagen des Online Marketings"},{"$f":"IFERROR(IF(INDEX($J$6:$XFD$85,C26,MATCH('Anrechnung erbrachter Leistung'!$B$9,$J$3:$XFD$3,)+0)=0,\"\",IFERROR(INDEX($J$6:$XFD$85,C26,MATCH('Anrechnung erbrachter Leistung'!$B$9,$J$3:$XFD$3,)+0),\"\")),\"\")","v":""},{"$f":"IFERROR(IF(ISBLANK(INDEX($J$6:$XFD$85,C26,MATCH('Anrechnung erbrachter Leistung'!$B$9,$J$3:$XFD$3,)+2)),\"\",IFERROR(INDEX($J$6:$XFD$85,C26,MATCH('Anrechnung erbrachter Leistung'!$B$9,$J$3:$XFD$3,)+2),\"\")),\"\")","v":5},null,null,21,null,"WP-Modul 1 - Projektwerkstatt und wiss. Arbeiten",5,null,null,"WP-Modul 2-5 - Einf. in das maschinelle Lernen",5,null,null,"WP-Modul 1 - Technisches Englisch",5,null,null,"Vertiefung - Grundlagen des Online Marketings",5,null,null,"Vertiefung - Grundlagen des Online Marketings",5,null,null,"Medizinische Strahlenphysik",5,null,null,"Photonic Crystals and Materials",6]
[null,"",22,{"$f":"IFERROR(IF(INDEX($J$6:$XFD$85,C27,MATCH('Anrechnung erbrachter Leistung'!$B$9,$J$3:$XFD$3,)+1)=0,\"\",IFERROR(INDEX($J$6:$XFD$85,C27,MATCH('Anrechnung erbrachter Leistung'!$B$9,$J$3:$XFD$3,)+1),\"\")),\"\")","v":"Vertiefung - Grundlagen Projektmanagement"},{"$f":"IFERROR(IF(INDEX($J$6:$XFD$85,C27,MATCH('Anrechnung erbrachter Leistung'!$B$9,$J$3:$XFD$3,)+0)=0,\"\",IFERROR(INDEX($J$6:$XFD$85,C27,MATCH('Anrechnung erbrachter Leistung'!$B$9,$J$3:$XFD$3,)+0),\"\")),\"\")","v":""},{"$f":"IFERROR(IF(ISBLANK(INDEX($J$6:$XFD$85,C27,MATCH('Anrechnung erbrachter Leistung'!$B$9,$J$3:$XFD$3,)+2)),\"\",IFERROR(INDEX($J$6:$XFD$85,C27,MATCH('Anrechnung erbrachter Leistung'!$B$9,$J$3:$XFD$3,)+2),\"\")),\"\")","v":5},null,null,22,null,"WP-Modul 2-4 - Einführung in das maschinelle Lernen",5,null,null,"WP-Modul 2-5 - Einf. in das wiss. Arbeiten, Präsentieren, Publizieren",5,null,null,"WP-Modul 1 - Projektwerkstatt und wiss. Arbeiten",5,null,null,"Vertiefung - Grundlagen Projektmanagement",5,null,null,"Vertiefung - Grundlagen Projektmanagement",5,null,null,"Quantenphysik",5,null,null,"Photonic Integrated Circuits",6]
[null,"",23,{"$f":"IFERROR(IF(INDEX($J$6:$XFD$85,C28,MATCH('Anrechnung erbrachter Leistung'!$B$9,$J$3:$XFD$3,)+1)=0,\"\",IFERROR(INDEX($J$6:$XFD$85,C28,MATCH('Anrechnung erbrachter Leistung'!$B$9,$J$3:$XFD$3,)+1),\"\")),\"\")","v":"Vertiefung - Grundlagen u. Techniken des wiss. Arbeitens"},{"$f":"IFERROR(IF(INDEX($J$6:$XFD$85,C28,MATCH('Anrechnung erbrachter Leistung'!$B$9,$J$3:$XFD$3,)+0)=0,\"\",IFERROR(INDEX($J$6:$XFD$85,C28,MATCH('Anrechnung erbrachter Leistung'!$B$9,$J$3:$XFD$3,)+0),\"\")),\"\")","v":""},{"$f":"IFERROR(IF(ISBLANK(INDEX($J$6:$XFD$85,C28,MATCH('Anrechnung erbrachter Leistung'!$B$9,$J$3:$XFD$3,)+2)),\"\",IFERROR(INDEX($J$6:$XFD$85,C28,MATCH('Anrechnung erbrachter Leistung'!$B$9,$J$3:$XFD$3,)+2),\"\")),\"\")","v":5},null,null,23,null,"WP-Modul 2-4 - Einf. in die Finite-Elemente-Methode",5,null,null,"WP-Modul 2-5 - Grundl. der Betriebswirtschaftslehre",5,null,null,"WP-Modul 2-3 - Angewandte Steuerungs- und Regelungstechnik",5,null,null,"Vertiefung - Grundlagen u. Techniken des wiss. Arbeitens",5,null,null,"Vertiefung - Grundlagen u. Techniken des wiss. Arbeitens",5,null,null,"Forschungsprojekt",15,null,null,"Photovoltaic Systems",6]
[null,"",24,{"$f":"IFERROR(IF(INDEX($J$6:$XFD$85,C29,MATCH('Anrechnung erbrachter Leistung'!$B$9,$J$3:$XFD$3,)+1)=0,\"\",IFERROR(INDEX($J$6:$XFD$85,C29,MATCH('Anrechnung erbrachter Leistung'!$B$9,$J$3:$XFD$3,)+1),\"\")),\"\")","v":"Vertiefung - Humanressourcen Management"},{"$f":"IFERROR(IF(INDEX($J$6:$XFD$85,C29,MATCH('Anrechnung erbrachter Leistung'!$B$9,$J$3:$XFD$3,)+0)=0,\"\",IFERROR(INDEX($J$6:$XFD$85,C29,MATCH('Anrechnung erbrachter Leistung'!$B$9,$J$3:$XFD$3,)+0),\"\")),\"\")","v":""},{"$f":"IFERROR(IF(ISBLANK(INDEX($J$6:$XFD$85,C29,MATCH('Anrechnung erbrachter Leistung'!$B$9,$J$3:$XFD$3,)+2)),\"\",IFERROR(INDEX($J$6:$XFD$85,C29,MATCH('Anrechnung erbrachter Leistung'!$B$9,$J$3:$XFD$3,)+2),\"\")),\"\")","v":5},null,null,24,null,"WP-Modul 2-4 - Grundlagen der BWL",5,null,null,"WP-Modul 2-5 - Hardwarenahe Programmierung für Physical Computing Projekte",5,null,null,"WP-Modul 2-3 - Einführung in das maschinelle Lernen",5,null,null,"Vertiefung - Humanressourcen Management",5,null,null,"Vertiefung - Humanressourcen Management",5,null,null,"Projektpraktikum",5,null,null,"Quantum Statsistical Physics",6]
[null,"",25,{"$f":"IFERROR(IF(INDEX($J$6:$XFD$85,C30,MATCH('Anrechnung erbrachter Leistung'!$B$9,$J$3:$XFD$3,)+1)=0,\"\",IFERROR(INDEX($J$6:$XFD$85,C30,MATCH('Anrechnung erbrachter Leistung'!$B$9,$J$3:$XFD$3,)+1),\"\")),\"\")","v":"Vertiefung - Internationales Management"},{"$f":"IFERROR(IF(INDEX($J$6:$XFD$85,C30,MATCH('Anrechnung erbrachter Leistung'!$B$9,$J$3:$XFD$3,)+0)=0,\"\",IFERROR(INDEX($J$6:$XFD$85,C30,MATCH('Anrechnung erbrachter Leistung'!$B$9,$J$3:$XFD$3,)+0),\"\")),\"\")","v":""},{"$f":"IFERROR(IF(ISBLANK(INDEX($J$6:$XFD$85,C30,MATCH('Anrechnung erbrachter Leistung'!$B$9,$J$3:$XFD$3,)+2)),\"\",IFERROR(INDEX($J$6:$XFD$85,C30,MATCH('Anrechnung erbrachter Leistung'!$B$9,$J$3:$XFD$3,)+2),\"\")),\"\")","v":5},null,null,25,null,"WP-Modul 2-4 - Hardwarenahe Programmierung für Physical Computing Projekte",5,null,null,"WP-Modul 2-5 - Softwareentwicklung für die Mess-, Steuer- und Regelungstechnik",5,null,null,"WP-Modul 2-3 - Einführung in die Finite-Elemente-Methode",5,null,null,"Vertiefung - Internationales Management",5,null,null,"Vertiefung - Internationales Management",5,null,null,"Freie Wahl aus dem Katalog der Mastermodule der FH MS oder aus der Kooperations mit der Uni Münster",10,null,null,"Solid State Physics and Semiconductors",6]
[null,"",26,{"$f":"IFERROR(IF(INDEX($J$6:$XFD$85,C31,MATCH('Anrechnung erbrachter Leistung'!$B$9,$J$3:$XFD$3,)+1)=0,\"\",IFERROR(INDEX($J$6:$XFD$85,C31,MATCH('Anrechnung erbrachter Leistung'!$B$9,$J$3:$XFD$3,)+1),\"\")),\"\")","v":"Vertiefung - Kommunikationstraining"},{"$f":"IFERROR(IF(INDEX($J$6:$XFD$85,C31,MATCH('Anrechnung erbrachter Leistung'!$B$9,$J$3:$XFD$3,)+0)=0,\"\",IFERROR(INDEX($J$6:$XFD$85,C31,MATCH('Anrechnung erbrachter Leistung'!$B$9,$J$3:$XFD$3,)+0),\"\")),\"\")","v":""},{"$f":"IFERROR(IF(ISBLANK(INDEX($J$6:$XFD$85,C31,MATCH('Anrechnung erbrachter Leistung'!$B$9,$J$3:$XFD$3,)+2)),\"\",IFERROR(INDEX($J$6:$XFD$85,C31,MATCH('Anrechnung erbrachter Leistung'!$B$9,$J$3:$XFD$3,)+2),\"\")),\"\")","v":5},null,null,26,null,"WP-Modul 2-4 - Mathematik III",5,null,null,"WP-Modul 2-5 - Technisches Englisch",5,null,null,"WP-Modul 2-3 - Freie Wahl aus dem Bachelorangebot der FH Münster",5,null,null,"Vertiefung - Kommunikationstraining",5,null,null,"Vertiefung - Kommunikationstraining",5,null,null,"Masterthesis",12,null,null,"Free optional module"]
[null,"",27,{"$f":"IFERROR(IF(INDEX($J$6:$XFD$85,C32,MATCH('Anrechnung erbrachter Leistung'!$B$9,$J$3:$XFD$3,)+1)=0,\"\",IFERROR(INDEX($J$6:$XFD$85,C32,MATCH('Anrechnung erbrachter Leistung'!$B$9,$J$3:$XFD$3,)+1),\"\")),\"\")","v":"Vertiefung - Marktforschung"},{"$f":"IFERROR(IF(INDEX($J$6:$XFD$85,C32,MATCH('Anrechnung erbrachter Leistung'!$B$9,$J$3:$XFD$3,)+0)=0,\"\",IFERROR(INDEX($J$6:$XFD$85,C32,MATCH('Anrechnung erbrachter Leistung'!$B$9,$J$3:$XFD$3,)+0),\"\")),\"\")","v":""},{"$f":"IFERROR(IF(ISBLANK(INDEX($J$6:$XFD$85,C32,MATCH('Anrechnung erbrachter Leistung'!$B$9,$J$3:$XFD$3,)+2)),\"\",IFERROR(INDEX($J$6:$XFD$85,C32,MATCH('Anrechnung erbrachter Leistung'!$B$9,$J$3:$XFD$3,)+2),\"\")),\"\")","v":5},null,null,27,null,"WP-Modul 2-4 - Softwareentwicklung für die Mess-, Steuer- und Regelungstechnik",5,null,null,"WP-Modul 2-5 - Freie Wahl aus dem Bachelorangebot der FH Münster",5,null,null,"WP-Modul 2-3 - Haltung und Bewegung aus interdisziplinärer Sicht",5,null,null,"Vertiefung - Marktforschung",5,null,null,"Vertiefung - Marktforschung",5,null,null,"Kolloquium",3,null,null,"Colloquium",5]
[null,null,28,{"$f":"IFERROR(IF(INDEX($J$6:$XFD$85,C33,MATCH('Anrechnung erbrachter Leistung'!$B$9,$J$3:$XFD$3,)+1)=0,\"\",IFERROR(INDEX($J$6:$XFD$85,C33,MATCH('Anrechnung erbrachter Leistung'!$B$9,$J$3:$XFD$3,)+1),\"\")),\"\")","v":"Vertiefung - Markenmanagement"},{"$f":"IFERROR(IF(INDEX($J$6:$XFD$85,C33,MATCH('Anrechnung erbrachter Leistung'!$B$9,$J$3:$XFD$3,)+0)=0,\"\",IFERROR(INDEX($J$6:$XFD$85,C33,MATCH('Anrechnung erbrachter Leistung'!$B$9,$J$3:$XFD$3,)+0),\"\")),\"\")","v":""},{"$f":"IFERROR(IF(ISBLANK(INDEX($J$6:$XFD$85,C33,MATCH('Anrechnung erbrachter Leistung'!$B$9,$J$3:$XFD$3,)+2)),\"\",IFERROR(INDEX($J$6:$XFD$85,C33,MATCH('Anrechnung erbrachter Leistung'!$B$9,$J$3:$XFD$3,)+2),\"\")),\"\")","v":5},null,null,28,null,"WP-Modul 2-4 - Technisches Englisch",5,null,null,"WP-Modul 2-5 - Modul aus Auslandssemester",5,null,null,"WP-Modul 2-3 - Hardwarenahe Programmierung für Phyiscal Computing Projekte",5,null,null,"Vertiefung - Markenmanagement",5,null,null,"Vertiefung - Markenmanagement",5,null,null,null,null,null,null,"Master Thesis",25]
[null,null,29,{"$f":"IFERROR(IF(INDEX($J$6:$XFD$85,C34,MATCH('Anrechnung erbrachter Leistung'!$B$9,$J$3:$XFD$3,)+1)=0,\"\",IFERROR(INDEX($J$6:$XFD$85,C34,MATCH('Anrechnung erbrachter Leistung'!$B$9,$J$3:$XFD$3,)+1),\"\")),\"\")","v":""},{"$f":"IFERROR(IF(INDEX($J$6:$XFD$85,C34,MATCH('Anrechnung erbrachter Leistung'!$B$9,$J$3:$XFD$3,)+0)=0,\"\",IFERROR(INDEX($J$6:$XFD$85,C34,MATCH('Anrechnung erbrachter Leistung'!$B$9,$J$3:$XFD$3,)+0),\"\")),\"\")","v":""},{"$f":"IFERROR(IF(ISBLANK(INDEX($J$6:$XFD$85,C34,MATCH('Anrechnung erbrachter Leistung'!$B$9,$J$3:$XFD$3,)+2)),\"\",IFERROR(INDEX($J$6:$XFD$85,C34,MATCH('Anrechnung erbrachter Leistung'!$B$9,$J$3:$XFD$3,)+2),\"\")),\"\")","v":""},null,null,29,null,"WP-Modul 2-4 - Freie Wahl aus dem Bachelorangebot der FH Münster",5,null,null,"Praxisphase",15,null,null,"WP-Modul 2-3 - Medizinische Grundlagen",5,null,null,null,null,null,null,"Vertiefung - Spanisch für Ingenieurwissenschaften I und lateinamerikanische Kultur",5]
[null,null,30,{"$f":"IFERROR(IF(INDEX($J$6:$XFD$85,C35,MATCH('Anrechnung erbrachter Leistung'!$B$9,$J$3:$XFD$3,)+1)=0,\"\",IFERROR(INDEX($J$6:$XFD$85,C35,MATCH('Anrechnung erbrachter Leistung'!$B$9,$J$3:$XFD$3,)+1),\"\")),\"\")","v":"Vertiefung - Spanisch für Ingenieurwissenschaften I und lateinamerikanische Kultur"},{"$f":"IFERROR(IF(INDEX($J$6:$XFD$85,C35,MATCH('Anrechnung erbrachter Leistung'!$B$9,$J$3:$XFD$3,)+0)=0,\"\",IFERROR(INDEX($J$6:$XFD$85,C35,MATCH('Anrechnung erbrachter Leistung'!$B$9,$J$3:$XFD$3,)+0),\"\")),\"\")","v":""},{"$f":"IFERROR(IF(ISBLANK(INDEX($J$6:$XFD$85,C35,MATCH('Anrechnung erbrachter Leistung'!$B$9,$J$3:$XFD$3,)+2)),\"\",IFERROR(INDEX($J$6:$XFD$85,C35,MATCH('Anrechnung erbrachter Leistung'!$B$9,$J$3:$XFD$3,)+2),\"\")),\"\")","v":5},null,null,30,null,"WP-Modul 2-4 - Modul aus dem Auslandssemester",5,null,null,"Bachelorthesis",12,null,null,"WP-Modul 2-3 - Modul aus Auslandssemester",5,null,null,"Vertiefung - Spanisch für Ingenieurwissenschaften I und lateinamerikanische Kultur",5,null,null,"Vertiefung - Unternehmensbewertung",5]
[null,null,31,{"$f":"IFERROR(IF(INDEX($J$6:$XFD$85,C36,MATCH('Anrechnung erbrachter Leistung'!$B$9,$J$3:$XFD$3,)+1)=0,\"\",IFERROR(INDEX($J$6:$XFD$85,C36,MATCH('Anrechnung erbrachter Leistung'!$B$9,$J$3:$XFD$3,)+1),\"\")),\"\")","v":"Vertiefung - Unternehmensbewertung"},{"$f":"IFERROR(IF(INDEX($J$6:$XFD$85,C36,MATCH('Anrechnung erbrachter Leistung'!$B$9,$J$3:$XFD$3,)+0)=0,\"\",IFERROR(INDEX($J$6:$XFD$85,C36,MATCH('Anrechnung erbrachter Leistung'!$B$9,$J$3:$XFD$3,)+0),\"\")),\"\")","v":""},{"$f":"IFERROR(IF(ISBLANK(INDEX($J$6:$XFD$85,C36,MATCH('Anrechnung erbrachter Leistung'!$B$9,$J$3:$XFD$3,)+2)),\"\",IFERROR(INDEX($J$6:$XFD$85,C36,MATCH('Anrechnung erbrachter Leistung'!$B$9,$J$3:$XFD$3,)+2),\"\")),\"\")","v":5},null,null,31,null,"Praxisphase",15,null,null,"Kolloquium",3,null,null,"WP-Modul 2-3 - Softwareentwicklung für die Mess-, Steuer- und Regelungstechnik",5,null,null,"Vertiefung - Unternehmensbewertung",5,null,null,"Vertiefung - Unternehmensplanspiel TOPSIM",5]
[null,null,32,{"$f":"IFERROR(IF(INDEX($J$6:$XFD$85,C37,MATCH('Anrechnung erbrachter Leistung'!$B$9,$J$3:$XFD$3,)+1)=0,\"\",IFERROR(INDEX($J$6:$XFD$85,C37,MATCH('Anrechnung erbrachter Leistung'!$B$9,$J$3:$XFD$3,)+1),\"\")),\"\")","v":"Vertiefung - Unternehmensplanspiel TOPSIM"},{"$f":"IFERROR(IF(INDEX($J$6:$XFD$85,C37,MATCH('Anrechnung erbrachter Leistung'!$B$9,$J$3:$XFD$3,)+0)=0,\"\",IFERROR(INDEX($J$6:$XFD$85,C37,MATCH('Anrechnung erbrachter Leistung'!$B$9,$J$3:$XFD$3,)+0),\"\")),\"\")","v":""},{"$f":"IFERROR(IF(ISBLANK(INDEX($J$6:$XFD$85,C37,MATCH('Anrechnung erbrachter Leistung'!$B$9,$J$3:$XFD$3,)+2)),\"\",IFERROR(INDEX($J$6:$XFD$85,C37,MATCH('Anrechnung erbrachter Leistung'!$B$9,$J$3:$XFD$3,)+2),\"\")),\"\")","v":5},null,null,32,null,"Bachelorthesis",12,null,null,null,null,null,null,"WP-Modul 2-3 - Technisches Englisch",5,null,null,"Vertiefung - Unternehmensplanspiel TOPSIM",5,null,null,"Vertiefung - Wirtschaftsrecht",5]
[null,null,33,{"$f":"IFERROR(IF(INDEX($J$6:$XFD$85,C38,MATCH('Anrechnung erbrachter Leistung'!$B$9,$J$3:$XFD$3,)+1)=0,\"\",IFERROR(INDEX($J$6:$XFD$85,C38,MATCH('Anrechnung erbrachter Leistung'!$B$9,$J$3:$XFD$3,)+1),\"\")),\"\")","v":"Vertiefung - Wirtschaftsrecht"},{"$f":"IFERROR(IF(INDEX($J$6:$XFD$85,C38,MATCH('Anrechnung erbrachter Leistung'!$B$9,$J$3:$XFD$3,)+0)=0,\"\",IFERROR(INDEX($J$6:$XFD$85,C38,MATCH('Anrechnung erbrachter Leistung'!$B$9,$J$3:$XFD$3,)+0),\"\")),\"\")","v":""},{"$f":"IFERROR(IF(ISBLANK(INDEX($J$6:$XFD$85,C38,MATCH('Anrechnung erbrachter Leistung'!$B$9,$J$3:$XFD$3,)+2)),\"\",IFERROR(INDEX($J$6:$XFD$85,C38,MATCH('Anrechnung erbrachter Leistung'!$B$9,$J$3:$XFD$3,)+2),\"\")),\"\")","v":5},null,null,33,null,"Kolloquium",3,null,null,null,null,null,null,"Bachelorthesis ",12,null,null,"Vertiefung - Wirtschaftsrecht",5,null,null,"Vertiefung - Betriebswirtschaftliche Module aus Auslandssemester",10]
[null,null,34,{"$f":"IFERROR(IF(INDEX($J$6:$XFD$85,C39,MATCH('Anrechnung erbrachter Leistung'!$B$9,$J$3:$XFD$3,)+1)=0,\"\",IFERROR(INDEX($J$6:$XFD$85,C39,MATCH('Anrechnung erbrachter Leistung'!$B$9,$J$3:$XFD$3,)+1),\"\")),\"\")","v":"Vertiefung - Betriebswirtschaftliche Module aus Auslandssemester"},{"$f":"IFERROR(IF(INDEX($J$6:$XFD$85,C39,MATCH('Anrechnung erbrachter Leistung'!$B$9,$J$3:$XFD$3,)+0)=0,\"\",IFERROR(INDEX($J$6:$XFD$85,C39,MATCH('Anrechnung erbrachter Leistung'!$B$9,$J$3:$XFD$3,)+0),\"\")),\"\")","v":""},{"$f":"IFERROR(IF(ISBLANK(INDEX($J$6:$XFD$85,C39,MATCH('Anrechnung erbrachter Leistung'!$B$9,$J$3:$XFD$3,)+2)),\"\",IFERROR(INDEX($J$6:$XFD$85,C39,MATCH('Anrechnung erbrachter Leistung'!$B$9,$J$3:$XFD$3,)+2),\"\")),\"\")","v":10},null,null,34,null,null,null,null,null,null,null,null,null,"Kolloquium",3,null,null,"Vertiefung - Betriebswirtschaftliche Module aus Auslandssemester",10,null,null,"WP-Bereich Technik I: Angewandte Steuerungs- und Regelungstechnik",5]
[null,null,35,{"$f":"IFERROR(IF(INDEX($J$6:$XFD$85,C40,MATCH('Anrechnung erbrachter Leistung'!$B$9,$J$3:$XFD$3,)+1)=0,\"\",IFERROR(INDEX($J$6:$XFD$85,C40,MATCH('Anrechnung erbrachter Leistung'!$B$9,$J$3:$XFD$3,)+1),\"\")),\"\")","v":"WP-Bereich Technik I: Biophysik"},{"$f":"IFERROR(IF(INDEX($J$6:$XFD$85,C40,MATCH('Anrechnung erbrachter Leistung'!$B$9,$J$3:$XFD$3,)+0)=0,\"\",IFERROR(INDEX($J$6:$XFD$85,C40,MATCH('Anrechnung erbrachter Leistung'!$B$9,$J$3:$XFD$3,)+0),\"\")),\"\")","v":""},{"$f":"IFERROR(IF(ISBLANK(INDEX($J$6:$XFD$85,C40,MATCH('Anrechnung erbrachter Leistung'!$B$9,$J$3:$XFD$3,)+2)),\"\",IFERROR(INDEX($J$6:$XFD$85,C40,MATCH('Anrechnung erbrachter Leistung'!$B$9,$J$3:$XFD$3,)+2),\"\")),\"\")","v":5},null,null,35,null,null,null,null,null,null,null,null,null,null,null,null,null,"WP-Bereich Technik I: Biophysik",5,null,null,"WP-Bereich Technik I: Grundlagen der Lasertechnik",5]
[null,null,36,{"$f":"IFERROR(IF(INDEX($J$6:$XFD$85,C41,MATCH('Anrechnung erbrachter Leistung'!$B$9,$J$3:$XFD$3,)+1)=0,\"\",IFERROR(INDEX($J$6:$XFD$85,C41,MATCH('Anrechnung erbrachter Leistung'!$B$9,$J$3:$XFD$3,)+1),\"\")),\"\")","v":"WP-Bereich Technik I: Biosignale"},{"$f":"IFERROR(IF(INDEX($J$6:$XFD$85,C41,MATCH('Anrechnung erbrachter Leistung'!$B$9,$J$3:$XFD$3,)+0)=0,\"\",IFERROR(INDEX($J$6:$XFD$85,C41,MATCH('Anrechnung erbrachter Leistung'!$B$9,$J$3:$XFD$3,)+0),\"\")),\"\")","v":""},{"$f":"IFERROR(IF(ISBLANK(INDEX($J$6:$XFD$85,C41,MATCH('Anrechnung erbrachter Leistung'!$B$9,$J$3:$XFD$3,)+2)),\"\",IFERROR(INDEX($J$6:$XFD$85,C41,MATCH('Anrechnung erbrachter Leistung'!$B$9,$J$3:$XFD$3,)+2),\"\")),\"\")","v":5},null,null,36,null,null,null,null,null,null,null,null,null,null,null,null,null,"WP-Bereich Technik I: Biosignale",5,null,null,"WP-Bereich Technik I: Laseranwendungen",5]
[null,null,37,{"$f":"IFERROR(IF(INDEX($J$6:$XFD$85,C42,MATCH('Anrechnung erbrachter Leistung'!$B$9,$J$3:$XFD$3,)+1)=0,\"\",IFERROR(INDEX($J$6:$XFD$85,C42,MATCH('Anrechnung erbrachter Leistung'!$B$9,$J$3:$XFD$3,)+1),\"\")),\"\")","v":"WP-Bereich Technik I: Chemie für Ingenieure"},{"$f":"IFERROR(IF(INDEX($J$6:$XFD$85,C42,MATCH('Anrechnung erbrachter Leistung'!$B$9,$J$3:$XFD$3,)+0)=0,\"\",IFERROR(INDEX($J$6:$XFD$85,C42,MATCH('Anrechnung erbrachter Leistung'!$B$9,$J$3:$XFD$3,)+0),\"\")),\"\")","v":""},{"$f":"IFERROR(IF(ISBLANK(INDEX($J$6:$XFD$85,C42,MATCH('Anrechnung erbrachter Leistung'!$B$9,$J$3:$XFD$3,)+2)),\"\",IFERROR(INDEX($J$6:$XFD$85,C42,MATCH('Anrechnung erbrachter Leistung'!$B$9,$J$3:$XFD$3,)+2),\"\")),\"\")","v":5},null,null,37,null,null,null,null,null,null,null,null,null,null,null,null,null,"WP-Bereich Technik I: Chemie für Ingenieure",5,null,null,"WP-Bereich Technik I: Quantenphysik",5]
[null,null,38,{"$f":"IFERROR(IF(INDEX($J$6:$XFD$85,C43,MATCH('Anrechnung erbrachter Leistung'!$B$9,$J$3:$XFD$3,)+1)=0,\"\",IFERROR(INDEX($J$6:$XFD$85,C43,MATCH('Anrechnung erbrachter Leistung'!$B$9,$J$3:$XFD$3,)+1),\"\")),\"\")","v":"WP-Bereich Technik I: Klinische Biomechanik"},{"$f":"IFERROR(IF(INDEX($J$6:$XFD$85,C43,MATCH('Anrechnung erbrachter Leistung'!$B$9,$J$3:$XFD$3,)+0)=0,\"\",IFERROR(INDEX($J$6:$XFD$85,C43,MATCH('Anrechnung erbrachter Leistung'!$B$9,$J$3:$XFD$3,)+0),\"\")),\"\")","v":""},{"$f":"IFERROR(IF(ISBLANK(INDEX($J$6:$XFD$85,C43,MATCH('Anrechnung erbrachter Leistung'!$B$9,$J$3:$XFD$3,)+2)),\"\",IFERROR(INDEX($J$6:$XFD$85,C43,MATCH('Anrechnung erbrachter Leistung'!$B$9,$J$3:$XFD$3,)+2),\"\")),\"\")","v":5},null,null,38,null,null,null,null,null,null,null,null,null,null,null,null,null,"WP-Bereich Technik I: Klinische Biomechanik",5,null,null,"WP-Bereich Technik I: Technische Optik",10]
[null,null,39,{"$f":"IFERROR(IF(INDEX($J$6:$XFD$85,C44,MATCH('Anrechnung erbrachter Leistung'!$B$9,$J$3:$XFD$3,)+1)=0,\"\",IFERROR(INDEX($J$6:$XFD$85,C44,MATCH('Anrechnung erbrachter Leistung'!$B$9,$J$3:$XFD$3,)+1),\"\")),\"\")","v":"WP-Bereich Technik I: Medizinische Grundlagen"},{"$f":"IFERROR(IF(INDEX($J$6:$XFD$85,C44,MATCH('Anrechnung erbrachter Leistung'!$B$9,$J$3:$XFD$3,)+0)=0,\"\",IFERROR(INDEX($J$6:$XFD$85,C44,MATCH('Anrechnung erbrachter Leistung'!$B$9,$J$3:$XFD$3,)+0),\"\")),\"\")","v":""},{"$f":"IFERROR(IF(ISBLANK(INDEX($J$6:$XFD$85,C44,MATCH('Anrechnung erbrachter Leistung'!$B$9,$J$3:$XFD$3,)+2)),\"\",IFERROR(INDEX($J$6:$XFD$85,C44,MATCH('Anrechnung erbrachter Leistung'!$B$9,$J$3:$XFD$3,)+2),\"\")),\"\")","v":5},null,null,39,null,null,null,null,null,null,null,null,null,null,null,null,null,"WP-Bereich Technik I: Medizinische Grundlagen",5,null,null,"WP-Bereich Technik I: Ingenieurwissenschaftliches Modul aus Auslandssemester",5]
[null,null,40,{"$f":"IFERROR(IF(INDEX($J$6:$XFD$85,C45,MATCH('Anrechnung erbrachter Leistung'!$B$9,$J$3:$XFD$3,)+1)=0,\"\",IFERROR(INDEX($J$6:$XFD$85,C45,MATCH('Anrechnung erbrachter Leistung'!$B$9,$J$3:$XFD$3,)+1),\"\")),\"\")","v":"WP-Bereich Technik I: Medizingerätetechnik"},{"$f":"IFERROR(IF(INDEX($J$6:$XFD$85,C45,MATCH('Anrechnung erbrachter Leistung'!$B$9,$J$3:$XFD$3,)+0)=0,\"\",IFERROR(INDEX($J$6:$XFD$85,C45,MATCH('Anrechnung erbrachter Leistung'!$B$9,$J$3:$XFD$3,)+0),\"\")),\"\")","v":""},{"$f":"IFERROR(IF(ISBLANK(INDEX($J$6:$XFD$85,C45,MATCH('Anrechnung erbrachter Leistung'!$B$9,$J$3:$XFD$3,)+2)),\"\",IFERROR(INDEX($J$6:$XFD$85,C45,MATCH('Anrechnung erbrachter Leistung'!$B$9,$J$3:$XFD$3,)+2),\"\")),\"\")","v":10},null,null,40,null,null,null,null,null,null,null,null,null,null,null,null,null,"WP-Bereich Technik I: Medizingerätetechnik",10,null,null,"WP-Bereich Technik II: Einführung in das maschinelle Lernen",6]
[null,null,41,{"$f":"IFERROR(IF(INDEX($J$6:$XFD$85,C46,MATCH('Anrechnung erbrachter Leistung'!$B$9,$J$3:$XFD$3,)+1)=0,\"\",IFERROR(INDEX($J$6:$XFD$85,C46,MATCH('Anrechnung erbrachter Leistung'!$B$9,$J$3:$XFD$3,)+1),\"\")),\"\")","v":"WP-Bereich Technik I: Medizinische Physik"},{"$f":"IFERROR(IF(INDEX($J$6:$XFD$85,C46,MATCH('Anrechnung erbrachter Leistung'!$B$9,$J$3:$XFD$3,)+0)=0,\"\",IFERROR(INDEX($J$6:$XFD$85,C46,MATCH('Anrechnung erbrachter Leistung'!$B$9,$J$3:$XFD$3,)+0),\"\")),\"\")","v":""},{"$f":"IFERROR(IF(ISBLANK(INDEX($J$6:$XFD$85,C46,MATCH('Anrechnung erbrachter Leistung'!$B$9,$J$3:$XFD$3,)+2)),\"\",IFERROR(INDEX($J$6:$XFD$85,C46,MATCH('Anrechnung erbrachter Leistung'!$B$9,$J$3:$XFD$3,)+2),\"\")),\"\")","v":5},null,null,41,null,null,null,null,null,null,null,null,null,null,null,null,null,"WP-Bereich Technik I: Medizinische Physik",5,null,null,"WP-Bereich Technik II: Einführung in die Finite-Elemente-Methode",5]
[null,null,42,{"$f":"IFERROR(IF(INDEX($J$6:$XFD$85,C47,MATCH('Anrechnung erbrachter Leistung'!$B$9,$J$3:$XFD$3,)+1)=0,\"\",IFERROR(INDEX($J$6:$XFD$85,C47,MATCH('Anrechnung erbrachter Leistung'!$B$9,$J$3:$XFD$3,)+1),\"\")),\"\")","v":"WP-Bereich Technik I: Medizinprodukterecht"},{"$f":"IFERROR(IF(INDEX($J$6:$XFD$85,C47,MATCH('Anrechnung erbrachter Leistung'!$B$9,$J$3:$XFD$3,)+0)=0,\"\",IFERROR(INDEX($J$6:$XFD$85,C47,MATCH('Anrechnung erbrachter Leistung'!$B$9,$J$3:$XFD$3,)+0),\"\")),\"\")","v":""},{"$f":"IFERROR(IF(ISBLANK(INDEX($J$6:$XFD$85,C47,MATCH('Anrechnung erbrachter Leistung'!$B$9,$J$3:$XFD$3,)+2)),\"\",IFERROR(INDEX($J$6:$XFD$85,C47,MATCH('Anrechnung erbrachter Leistung'!$B$9,$J$3:$XFD$3,)+2),\"\")),\"\")","v":5},null,null,42,null,null,null,null,null,null,null,null,null,null,null,null,null,"WP-Bereich Technik I: Medizinprodukterecht",5,null,null,"WP-Bereich Technik II: Hardwarenahe Programmierung für Physical Computing Projekte",5]
[null,null,43,{"$f":"IFERROR(IF(INDEX($J$6:$XFD$85,C48,MATCH('Anrechnung erbrachter Leistung'!$B$9,$J$3:$XFD$3,)+1)=0,\"\",IFERROR(INDEX($J$6:$XFD$85,C48,MATCH('Anrechnung erbrachter Leistung'!$B$9,$J$3:$XFD$3,)+1),\"\")),\"\")","v":"WP-Bereich Technik I: Technisches Englisch"},{"$f":"IFERROR(IF(INDEX($J$6:$XFD$85,C48,MATCH('Anrechnung erbrachter Leistung'!$B$9,$J$3:$XFD$3,)+0)=0,\"\",IFERROR(INDEX($J$6:$XFD$85,C48,MATCH('Anrechnung erbrachter Leistung'!$B$9,$J$3:$XFD$3,)+0),\"\")),\"\")","v":""},{"$f":"IFERROR(IF(ISBLANK(INDEX($J$6:$XFD$85,C48,MATCH('Anrechnung erbrachter Leistung'!$B$9,$J$3:$XFD$3,)+2)),\"\",IFERROR(INDEX($J$6:$XFD$85,C48,MATCH('Anrechnung erbrachter Leistung'!$B$9,$J$3:$XFD$3,)+2),\"\")),\"\")","v":5},null,null,43,null,null,null,null,null,null,null,null,null,null,null,null,null,"WP-Bereich Technik I: Technisches Englisch",5,null,null,"WP-Bereich Technik II: Softwareentwicklung für die Mess-, Steuer- und Regelungstechnik",5]
[null,null,44,{"$f":"IFERROR(IF(INDEX($J$6:$XFD$85,C49,MATCH('Anrechnung erbrachter Leistung'!$B$9,$J$3:$XFD$3,)+1)=0,\"\",IFERROR(INDEX($J$6:$XFD$85,C49,MATCH('Anrechnung erbrachter Leistung'!$B$9,$J$3:$XFD$3,)+1),\"\")),\"\")","v":"WP-Bereich Technik I: Biomed. oder medizintechn. Modul aus Auslandssem."},{"$f":"IFERROR(IF(INDEX($J$6:$XFD$85,C49,MATCH('Anrechnung erbrachter Leistung'!$B$9,$J$3:$XFD$3,)+0)=0,\"\",IFERROR(INDEX($J$6:$XFD$85,C49,MATCH('Anrechnung erbrachter Leistung'!$B$9,$J$3:$XFD$3,)+0),\"\")),\"\")","v":""},{"$f":"IFERROR(IF(ISBLANK(INDEX($J$6:$XFD$85,C49,MATCH('Anrechnung erbrachter Leistung'!$B$9,$J$3:$XFD$3,)+2)),\"\",IFERROR(INDEX($J$6:$XFD$85,C49,MATCH('Anrechnung erbrachter Leistung'!$B$9,$J$3:$XFD$3,)+2),\"\")),\"\")","v":5},null,null,44,null,null,null,null,null,null,null,null,null,null,null,null,null,"WP-Bereich Technik I: Biomed. oder medizintechn. Modul aus Auslandssem.",5,null,null,"WP-Bereich Technik II: Technisches Englisch",5]
[null,null,45,{"$f":"IFERROR(IF(INDEX($J$6:$XFD$85,C50,MATCH('Anrechnung erbrachter Leistung'!$B$9,$J$3:$XFD$3,)+1)=0,\"\",IFERROR(INDEX($J$6:$XFD$85,C50,MATCH('Anrechnung erbrachter Leistung'!$B$9,$J$3:$XFD$3,)+1),\"\")),\"\")","v":"WP-Bereich Technik II: Angewandte Steuerungs- und Regelungstechnik"},{"$f":"IFERROR(IF(INDEX($J$6:$XFD$85,C50,MATCH('Anrechnung erbrachter Leistung'!$B$9,$J$3:$XFD$3,)+0)=0,\"\",IFERROR(INDEX($J$6:$XFD$85,C50,MATCH('Anrechnung erbrachter Leistung'!$B$9,$J$3:$XFD$3,)+0),\"\")),\"\")","v":""},{"$f":"IFERROR(IF(ISBLANK(INDEX($J$6:$XFD$85,C50,MATCH('Anrechnung erbrachter Leistung'!$B$9,$J$3:$XFD$3,)+2)),\"\",IFERROR(INDEX($J$6:$XFD$85,C50,MATCH('Anrechnung erbrachter Leistung'!$B$9,$J$3:$XFD$3,)+2),\"\")),\"\")","v":5},null,null,45,null,null,null,null,null,null,null,null,null,null,null,null,null,"WP-Bereich Technik II: Angewandte Steuerungs- und Regelungstechnik",5,null,null,"Praxisphase",15]
[null,null,46,{"$f":"IFERROR(IF(INDEX($J$6:$XFD$85,C51,MATCH('Anrechnung erbrachter Leistung'!$B$9,$J$3:$XFD$3,)+1)=0,\"\",IFERROR(INDEX($J$6:$XFD$85,C51,MATCH('Anrechnung erbrachter Leistung'!$B$9,$J$3:$XFD$3,)+1),\"\")),\"\")","v":"WP-Bereich Technik II: Einführung in das maschinelle Lernen"},{"$f":"IFERROR(IF(INDEX($J$6:$XFD$85,C51,MATCH('Anrechnung erbrachter Leistung'!$B$9,$J$3:$XFD$3,)+0)=0,\"\",IFERROR(INDEX($J$6:$XFD$85,C51,MATCH('Anrechnung erbrachter Leistung'!$B$9,$J$3:$XFD$3,)+0),\"\")),\"\")","v":""},{"$f":"IFERROR(IF(ISBLANK(INDEX($J$6:$XFD$85,C51,MATCH('Anrechnung erbrachter Leistung'!$B$9,$J$3:$XFD$3,)+2)),\"\",IFERROR(INDEX($J$6:$XFD$85,C51,MATCH('Anrechnung erbrachter Leistung'!$B$9,$J$3:$XFD$3,)+2),\"\")),\"\")","v":5},null,null,46,null,null,null,null,null,null,null,null,null,null,null,null,null,"WP-Bereich Technik II: Einführung in das maschinelle Lernen",5,null,null,"Bachelorthesis ",12]
[null,null,47,{"$f":"IFERROR(IF(INDEX($J$6:$XFD$85,C52,MATCH('Anrechnung erbrachter Leistung'!$B$9,$J$3:$XFD$3,)+1)=0,\"\",IFERROR(INDEX($J$6:$XFD$85,C52,MATCH('Anrechnung erbrachter Leistung'!$B$9,$J$3:$XFD$3,)+1),\"\")),\"\")","v":"WP-Bereich Technik II: Einführung in die Finite-Elemente-Methode"},{"$f":"IFERROR(IF(INDEX($J$6:$XFD$85,C52,MATCH('Anrechnung erbrachter Leistung'!$B$9,$J$3:$XFD$3,)+0)=0,\"\",IFERROR(INDEX($J$6:$XFD$85,C52,MATCH('Anrechnung erbrachter Leistung'!$B$9,$J$3:$XFD$3,)+0),\"\")),\"\")","v":""},{"$f":"IFERROR(IF(ISBLANK(INDEX($J$6:$XFD$85,C52,MATCH('Anrechnung erbrachter Leistung'!$B$9,$J$3:$XFD$3,)+2)),\"\",IFERROR(INDEX($J$6:$XFD$85,C52,MATCH('Anrechnung erbrachter Leistung'!$B$9,$J$3:$XFD$3,)+2),\"\")),\"\")","v":5},null,null,47,null,null,null,null,null,null,null,null,null,null,null,null,null,"WP-Bereich Technik II: Einführung in die Finite-Elemente-Methode",5,null,null,"Kolloquium",3]
[null,null,48,{"$f":"IFERROR(IF(INDEX($J$6:$XFD$85,C53,MATCH('Anrechnung erbrachter Leistung'!$B$9,$J$3:$XFD$3,)+1)=0,\"\",IFERROR(INDEX($J$6:$XFD$85,C53,MATCH('Anrechnung erbrachter Leistung'!$B$9,$J$3:$XFD$3,)+1),\"\")),\"\")","v":"WP-Bereich Technik II: Hardwarenahe Programmierung für Physical Computing Projekte"},{"$f":"IFERROR(IF(INDEX($J$6:$XFD$85,C53,MATCH('Anrechnung erbrachter Leistung'!$B$9,$J$3:$XFD$3,)+0)=0,\"\",IFERROR(INDEX($J$6:$XFD$85,C53,MATCH('Anrechnung erbrachter Leistung'!$B$9,$J$3:$XFD$3,)+0),\"\")),\"\")","v":""},{"$f":"IFERROR(IF(ISBLANK(INDEX($J$6:$XFD$85,C53,MATCH('Anrechnung erbrachter Leistung'!$B$9,$J$3:$XFD$3,)+2)),\"\",IFERROR(INDEX($J$6:$XFD$85,C53,MATCH('Anrechnung erbrachter Leistung'!$B$9,$J$3:$XFD$3,)+2),\"\")),\"\")","v":5},null,null,48,null,null,null,null,null,null,null,null,null,null,null,null,null,"WP-Bereich Technik II: Hardwarenahe Programmierung für Physical Computing Projekte",5]
[null,null,49,{"$f":"IFERROR(IF(INDEX($J$6:$XFD$85,C54,MATCH('Anrechnung erbrachter Leistung'!$B$9,$J$3:$XFD$3,)+1)=0,\"\",IFERROR(INDEX($J$6:$XFD$85,C54,MATCH('Anrechnung erbrachter Leistung'!$B$9,$J$3:$XFD$3,)+1),\"\")),\"\")","v":"WP-Bereich Technik II: Softwareentwicklung für die Mess-, Steuer- und Regelungstechnik"},{"$f":"IFERROR(IF(INDEX($J$6:$XFD$85,C54,MATCH('Anrechnung erbrachter Leistung'!$B$9,$J$3:$XFD$3,)+0)=0,\"\",IFERROR(INDEX($J$6:$XFD$85,C54,MATCH('Anrechnung erbrachter Leistung'!$B$9,$J$3:$XFD$3,)+0),\"\")),\"\")","v":""},{"$f":"IFERROR(IF(ISBLANK(INDEX($J$6:$XFD$85,C54,MATCH('Anrechnung erbrachter Leistung'!$B$9,$J$3:$XFD$3,)+2)),\"\",IFERROR(INDEX($J$6:$XFD$85,C54,MATCH('Anrechnung erbrachter Leistung'!$B$9,$J$3:$XFD$3,)+2),\"\")),\"\")","v":5},null,null,49,null,null,null,null,null,null,null,null,null,null,null,null,null,"WP-Bereich Technik II: Softwareentwicklung für die Mess-, Steuer- und Regelungstechnik",5]
[null,null,50,{"$f":"IFERROR(IF(INDEX($J$6:$XFD$85,C55,MATCH('Anrechnung erbrachter Leistung'!$B$9,$J$3:$XFD$3,)+1)=0,\"\",IFERROR(INDEX($J$6:$XFD$85,C55,MATCH('Anrechnung erbrachter Leistung'!$B$9,$J$3:$XFD$3,)+1),\"\")),\"\")","v":"WP-Bereich Technik II: Technisches Englisch"},{"$f":"IFERROR(IF(INDEX($J$6:$XFD$85,C55,MATCH('Anrechnung erbrachter Leistung'!$B$9,$J$3:$XFD$3,)+0)=0,\"\",IFERROR(INDEX($J$6:$XFD$85,C55,MATCH('Anrechnung erbrachter Leistung'!$B$9,$J$3:$XFD$3,)+0),\"\")),\"\")","v":""},{"$f":"IFERROR(IF(ISBLANK(INDEX($J$6:$XFD$85,C55,MATCH('Anrechnung erbrachter Leistung'!$B$9,$J$3:$XFD$3,)+2)),\"\",IFERROR(INDEX($J$6:$XFD$85,C55,MATCH('Anrechnung erbrachter Leistung'!$B$9,$J$3:$XFD$3,)+2),\"\")),\"\")","v":5},null,null,50,null,null,null,null,null,null,null,null,null,null,null,null,null,"WP-Bereich Technik II: Technisches Englisch",5]
[null,null,51,{"$f":"IFERROR(IF(INDEX($J$6:$XFD$85,C56,MATCH('Anrechnung erbrachter Leistung'!$B$9,$J$3:$XFD$3,)+1)=0,\"\",IFERROR(INDEX($J$6:$XFD$85,C56,MATCH('Anrechnung erbrachter Leistung'!$B$9,$J$3:$XFD$3,)+1),\"\")),\"\")","v":"Praxisphase"},{"$f":"IFERROR(IF(INDEX($J$6:$XFD$85,C56,MATCH('Anrechnung erbrachter Leistung'!$B$9,$J$3:$XFD$3,)+0)=0,\"\",IFERROR(INDEX($J$6:$XFD$85,C56,MATCH('Anrechnung erbrachter Leistung'!$B$9,$J$3:$XFD$3,)+0),\"\")),\"\")","v":""},{"$f":"IFERROR(IF(ISBLANK(INDEX($J$6:$XFD$85,C56,MATCH('Anrechnung erbrachter Leistung'!$B$9,$J$3:$XFD$3,)+2)),\"\",IFERROR(INDEX($J$6:$XFD$85,C56,MATCH('Anrechnung erbrachter Leistung'!$B$9,$J$3:$XFD$3,)+2),\"\")),\"\")","v":15},null,null,51,null,null,null,null,null,null,null,null,null,null,null,null,null,"Praxisphase",15]
[null,null,52,{"$f":"IFERROR(IF(INDEX($J$6:$XFD$85,C57,MATCH('Anrechnung erbrachter Leistung'!$B$9,$J$3:$XFD$3,)+1)=0,\"\",IFERROR(INDEX($J$6:$XFD$85,C57,MATCH('Anrechnung erbrachter Leistung'!$B$9,$J$3:$XFD$3,)+1),\"\")),\"\")","v":"Bachelorthesis"},{"$f":"IFERROR(IF(INDEX($J$6:$XFD$85,C57,MATCH('Anrechnung erbrachter Leistung'!$B$9,$J$3:$XFD$3,)+0)=0,\"\",IFERROR(INDEX($J$6:$XFD$85,C57,MATCH('Anrechnung erbrachter Leistung'!$B$9,$J$3:$XFD$3,)+0),\"\")),\"\")","v":""},{"$f":"IFERROR(IF(ISBLANK(INDEX($J$6:$XFD$85,C57,MATCH('Anrechnung erbrachter Leistung'!$B$9,$J$3:$XFD$3,)+2)),\"\",IFERROR(INDEX($J$6:$XFD$85,C57,MATCH('Anrechnung erbrachter Leistung'!$B$9,$J$3:$XFD$3,)+2),\"\")),\"\")","v":12},null,null,52,null,null,null,null,null,null,null,null,null,null,null,null,null,"Bachelorthesis",12]
[null,null,53,{"$f":"IFERROR(IF(INDEX($J$6:$XFD$85,C58,MATCH('Anrechnung erbrachter Leistung'!$B$9,$J$3:$XFD$3,)+1)=0,\"\",IFERROR(INDEX($J$6:$XFD$85,C58,MATCH('Anrechnung erbrachter Leistung'!$B$9,$J$3:$XFD$3,)+1),\"\")),\"\")","v":"Kolloquium"},{"$f":"IFERROR(IF(INDEX($J$6:$XFD$85,C58,MATCH('Anrechnung erbrachter Leistung'!$B$9,$J$3:$XFD$3,)+0)=0,\"\",IFERROR(INDEX($J$6:$XFD$85,C58,MATCH('Anrechnung erbrachter Leistung'!$B$9,$J$3:$XFD$3,)+0),\"\")),\"\")","v":""},{"$f":"IFERROR(IF(ISBLANK(INDEX($J$6:$XFD$85,C58,MATCH('Anrechnung erbrachter Leistung'!$B$9,$J$3:$XFD$3,)+2)),\"\",IFERROR(INDEX($J$6:$XFD$85,C58,MATCH('Anrechnung erbrachter Leistung'!$B$9,$J$3:$XFD$3,)+2),\"\")),\"\")","v":3},null,null,53,null,null,null,null,null,null,null,null,null,null,null,null,null,"Kolloquium",3]
[null,null,54,{"$f":"IFERROR(IF(INDEX($J$6:$XFD$85,C59,MATCH('Anrechnung erbrachter Leistung'!$B$9,$J$3:$XFD$3,)+1)=0,\"\",IFERROR(INDEX($J$6:$XFD$85,C59,MATCH('Anrechnung erbrachter Leistung'!$B$9,$J$3:$XFD$3,)+1),\"\")),\"\")","v":""},{"$f":"IFERROR(IF(INDEX($J$6:$XFD$85,C59,MATCH('Anrechnung erbrachter Leistung'!$B$9,$J$3:$XFD$3,)+0)=0,\"\",IFERROR(INDEX($J$6:$XFD$85,C59,MATCH('Anrechnung erbrachter Leistung'!$B$9,$J$3:$XFD$3,)+0),\"\")),\"\")","v":""},{"$f":"IFERROR(IF(ISBLANK(INDEX($J$6:$XFD$85,C59,MATCH('Anrechnung erbrachter Leistung'!$B$9,$J$3:$XFD$3,)+2)),\"\",IFERROR(INDEX($J$6:$XFD$85,C59,MATCH('Anrechnung erbrachter Leistung'!$B$9,$J$3:$XFD$3,)+2),\"\")),\"\")","v":""},null,null,54]
[null,null,55,{"$f":"IFERROR(IF(INDEX($J$6:$XFD$85,C60,MATCH('Anrechnung erbrachter Leistung'!$B$9,$J$3:$XFD$3,)+1)=0,\"\",IFERROR(INDEX($J$6:$XFD$85,C60,MATCH('Anrechnung erbrachter Leistung'!$B$9,$J$3:$XFD$3,)+1),\"\")),\"\")","v":""},{"$f":"IFERROR(IF(INDEX($J$6:$XFD$85,C60,MATCH('Anrechnung erbrachter Leistung'!$B$9,$J$3:$XFD$3,)+0)=0,\"\",IFERROR(INDEX($J$6:$XFD$85,C60,MATCH('Anrechnung erbrachter Leistung'!$B$9,$J$3:$XFD$3,)+0),\"\")),\"\")","v":""},{"$f":"IFERROR(IF(ISBLANK(INDEX($J$6:$XFD$85,C60,MATCH('Anrechnung erbrachter Leistung'!$B$9,$J$3:$XFD$3,)+2)),\"\",IFERROR(INDEX($J$6:$XFD$85,C60,MATCH('Anrechnung erbrachter Leistung'!$B$9,$J$3:$XFD$3,)+2),\"\")),\"\")","v":""},null,null,55]
[null,null,56,{"$f":"IFERROR(IF(INDEX($J$6:$XFD$85,C61,MATCH('Anrechnung erbrachter Leistung'!$B$9,$J$3:$XFD$3,)+1)=0,\"\",IFERROR(INDEX($J$6:$XFD$85,C61,MATCH('Anrechnung erbrachter Leistung'!$B$9,$J$3:$XFD$3,)+1),\"\")),\"\")","v":""},{"$f":"IFERROR(IF(INDEX($J$6:$XFD$85,C61,MATCH('Anrechnung erbrachter Leistung'!$B$9,$J$3:$XFD$3,)+0)=0,\"\",IFERROR(INDEX($J$6:$XFD$85,C61,MATCH('Anrechnung erbrachter Leistung'!$B$9,$J$3:$XFD$3,)+0),\"\")),\"\")","v":""},{"$f":"IFERROR(IF(ISBLANK(INDEX($J$6:$XFD$85,C61,MATCH('Anrechnung erbrachter Leistung'!$B$9,$J$3:$XFD$3,)+2)),\"\",IFERROR(INDEX($J$6:$XFD$85,C61,MATCH('Anrechnung erbrachter Leistung'!$B$9,$J$3:$XFD$3,)+2),\"\")),\"\")","v":""},null,null,56]
[null,null,57,{"$f":"IFERROR(IF(INDEX($J$6:$XFD$85,C62,MATCH('Anrechnung erbrachter Leistung'!$B$9,$J$3:$XFD$3,)+1)=0,\"\",IFERROR(INDEX($J$6:$XFD$85,C62,MATCH('Anrechnung erbrachter Leistung'!$B$9,$J$3:$XFD$3,)+1),\"\")),\"\")","v":""},{"$f":"IFERROR(IF(INDEX($J$6:$XFD$85,C62,MATCH('Anrechnung erbrachter Leistung'!$B$9,$J$3:$XFD$3,)+0)=0,\"\",IFERROR(INDEX($J$6:$XFD$85,C62,MATCH('Anrechnung erbrachter Leistung'!$B$9,$J$3:$XFD$3,)+0),\"\")),\"\")","v":""},{"$f":"IFERROR(IF(ISBLANK(INDEX($J$6:$XFD$85,C62,MATCH('Anrechnung erbrachter Leistung'!$B$9,$J$3:$XFD$3,)+2)),\"\",IFERROR(INDEX($J$6:$XFD$85,C62,MATCH('Anrechnung erbrachter Leistung'!$B$9,$J$3:$XFD$3,)+2),\"\")),\"\")","v":""},null,null,57]
[null,null,58,{"$f":"IFERROR(IF(INDEX($J$6:$XFD$85,C63,MATCH('Anrechnung erbrachter Leistung'!$B$9,$J$3:$XFD$3,)+1)=0,\"\",IFERROR(INDEX($J$6:$XFD$85,C63,MATCH('Anrechnung erbrachter Leistung'!$B$9,$J$3:$XFD$3,)+1),\"\")),\"\")","v":""},{"$f":"IFERROR(IF(INDEX($J$6:$XFD$85,C63,MATCH('Anrechnung erbrachter Leistung'!$B$9,$J$3:$XFD$3,)+0)=0,\"\",IFERROR(INDEX($J$6:$XFD$85,C63,MATCH('Anrechnung erbrachter Leistung'!$B$9,$J$3:$XFD$3,)+0),\"\")),\"\")","v":""},{"$f":"IFERROR(IF(ISBLANK(INDEX($J$6:$XFD$85,C63,MATCH('Anrechnung erbrachter Leistung'!$B$9,$J$3:$XFD$3,)+2)),\"\",IFERROR(INDEX($J$6:$XFD$85,C63,MATCH('Anrechnung erbrachter Leistung'!$B$9,$J$3:$XFD$3,)+2),\"\")),\"\")","v":""},null,null,58]
[null,null,59,{"$f":"IFERROR(IF(INDEX($J$6:$XFD$85,C64,MATCH('Anrechnung erbrachter Leistung'!$B$9,$J$3:$XFD$3,)+1)=0,\"\",IFERROR(INDEX($J$6:$XFD$85,C64,MATCH('Anrechnung erbrachter Leistung'!$B$9,$J$3:$XFD$3,)+1),\"\")),\"\")","v":""},{"$f":"IFERROR(IF(INDEX($J$6:$XFD$85,C64,MATCH('Anrechnung erbrachter Leistung'!$B$9,$J$3:$XFD$3,)+0)=0,\"\",IFERROR(INDEX($J$6:$XFD$85,C64,MATCH('Anrechnung erbrachter Leistung'!$B$9,$J$3:$XFD$3,)+0),\"\")),\"\")","v":""},{"$f":"IFERROR(IF(ISBLANK(INDEX($J$6:$XFD$85,C64,MATCH('Anrechnung erbrachter Leistung'!$B$9,$J$3:$XFD$3,)+2)),\"\",IFERROR(INDEX($J$6:$XFD$85,C64,MATCH('Anrechnung erbrachter Leistung'!$B$9,$J$3:$XFD$3,)+2),\"\")),\"\")","v":""},null,null,59]
[null,null,60,{"$f":"IFERROR(IF(INDEX($J$6:$XFD$85,C65,MATCH('Anrechnung erbrachter Leistung'!$B$9,$J$3:$XFD$3,)+1)=0,\"\",IFERROR(INDEX($J$6:$XFD$85,C65,MATCH('Anrechnung erbrachter Leistung'!$B$9,$J$3:$XFD$3,)+1),\"\")),\"\")","v":""},{"$f":"IFERROR(IF(INDEX($J$6:$XFD$85,C65,MATCH('Anrechnung erbrachter Leistung'!$B$9,$J$3:$XFD$3,)+0)=0,\"\",IFERROR(INDEX($J$6:$XFD$85,C65,MATCH('Anrechnung erbrachter Leistung'!$B$9,$J$3:$XFD$3,)+0),\"\")),\"\")","v":""},{"$f":"IFERROR(IF(ISBLANK(INDEX($J$6:$XFD$85,C65,MATCH('Anrechnung erbrachter Leistung'!$B$9,$J$3:$XFD$3,)+2)),\"\",IFERROR(INDEX($J$6:$XFD$85,C65,MATCH('Anrechnung erbrachter Leistung'!$B$9,$J$3:$XFD$3,)+2),\"\")),\"\")","v":""},null,null,60]
[null,null,61,{"$f":"IFERROR(IF(INDEX($J$6:$XFD$85,C66,MATCH('Anrechnung erbrachter Leistung'!$B$9,$J$3:$XFD$3,)+1)=0,\"\",IFERROR(INDEX($J$6:$XFD$85,C66,MATCH('Anrechnung erbrachter Leistung'!$B$9,$J$3:$XFD$3,)+1),\"\")),\"\")","v":""},{"$f":"IFERROR(IF(INDEX($J$6:$XFD$85,C66,MATCH('Anrechnung erbrachter Leistung'!$B$9,$J$3:$XFD$3,)+0)=0,\"\",IFERROR(INDEX($J$6:$XFD$85,C66,MATCH('Anrechnung erbrachter Leistung'!$B$9,$J$3:$XFD$3,)+0),\"\")),\"\")","v":""},{"$f":"IFERROR(IF(ISBLANK(INDEX($J$6:$XFD$85,C66,MATCH('Anrechnung erbrachter Leistung'!$B$9,$J$3:$XFD$3,)+2)),\"\",IFERROR(INDEX($J$6:$XFD$85,C66,MATCH('Anrechnung erbrachter Leistung'!$B$9,$J$3:$XFD$3,)+2),\"\")),\"\")","v":""},null,null,61]
[null,null,62,{"$f":"IFERROR(IF(INDEX($J$6:$XFD$85,C67,MATCH('Anrechnung erbrachter Leistung'!$B$9,$J$3:$XFD$3,)+1)=0,\"\",IFERROR(INDEX($J$6:$XFD$85,C67,MATCH('Anrechnung erbrachter Leistung'!$B$9,$J$3:$XFD$3,)+1),\"\")),\"\")","v":""},{"$f":"IFERROR(IF(INDEX($J$6:$XFD$85,C67,MATCH('Anrechnung erbrachter Leistung'!$B$9,$J$3:$XFD$3,)+0)=0,\"\",IFERROR(INDEX($J$6:$XFD$85,C67,MATCH('Anrechnung erbrachter Leistung'!$B$9,$J$3:$XFD$3,)+0),\"\")),\"\")","v":""},{"$f":"IFERROR(IF(ISBLANK(INDEX($J$6:$XFD$85,C67,MATCH('Anrechnung erbrachter Leistung'!$B$9,$J$3:$XFD$3,)+2)),\"\",IFERROR(INDEX($J$6:$XFD$85,C67,MATCH('Anrechnung erbrachter Leistung'!$B$9,$J$3:$XFD$3,)+2),\"\")),\"\")","v":""},null,null,62]
[null,null,63,{"$f":"IFERROR(IF(INDEX($J$6:$XFD$85,C68,MATCH('Anrechnung erbrachter Leistung'!$B$9,$J$3:$XFD$3,)+1)=0,\"\",IFERROR(INDEX($J$6:$XFD$85,C68,MATCH('Anrechnung erbrachter Leistung'!$B$9,$J$3:$XFD$3,)+1),\"\")),\"\")","v":""},{"$f":"IFERROR(IF(INDEX($J$6:$XFD$85,C68,MATCH('Anrechnung erbrachter Leistung'!$B$9,$J$3:$XFD$3,)+0)=0,\"\",IFERROR(INDEX($J$6:$XFD$85,C68,MATCH('Anrechnung erbrachter Leistung'!$B$9,$J$3:$XFD$3,)+0),\"\")),\"\")","v":""},{"$f":"IFERROR(IF(ISBLANK(INDEX($J$6:$XFD$85,C68,MATCH('Anrechnung erbrachter Leistung'!$B$9,$J$3:$XFD$3,)+2)),\"\",IFERROR(INDEX($J$6:$XFD$85,C68,MATCH('Anrechnung erbrachter Leistung'!$B$9,$J$3:$XFD$3,)+2),\"\")),\"\")","v":""},null,null,63]
[null,null,64,{"$f":"IFERROR(IF(INDEX($J$6:$XFD$85,C69,MATCH('Anrechnung erbrachter Leistung'!$B$9,$J$3:$XFD$3,)+1)=0,\"\",IFERROR(INDEX($J$6:$XFD$85,C69,MATCH('Anrechnung erbrachter Leistung'!$B$9,$J$3:$XFD$3,)+1),\"\")),\"\")","v":""},{"$f":"IFERROR(IF(INDEX($J$6:$XFD$85,C69,MATCH('Anrechnung erbrachter Leistung'!$B$9,$J$3:$XFD$3,)+0)=0,\"\",IFERROR(INDEX($J$6:$XFD$85,C69,MATCH('Anrechnung erbrachter Leistung'!$B$9,$J$3:$XFD$3,)+0),\"\")),\"\")","v":""},{"$f":"IFERROR(IF(ISBLANK(INDEX($J$6:$XFD$85,C69,MATCH('Anrechnung erbrachter Leistung'!$B$9,$J$3:$XFD$3,)+2)),\"\",IFERROR(INDEX($J$6:$XFD$85,C69,MATCH('Anrechnung erbrachter Leistung'!$B$9,$J$3:$XFD$3,)+2),\"\")),\"\")","v":""},null,null,64]
[null,null,65,{"$f":"IFERROR(IF(INDEX($J$6:$XFD$85,C70,MATCH('Anrechnung erbrachter Leistung'!$B$9,$J$3:$XFD$3,)+1)=0,\"\",IFERROR(INDEX($J$6:$XFD$85,C70,MATCH('Anrechnung erbrachter Leistung'!$B$9,$J$3:$XFD$3,)+1),\"\")),\"\")","v":""},{"$f":"IFERROR(IF(INDEX($J$6:$XFD$85,C70,MATCH('Anrechnung erbrachter Leistung'!$B$9,$J$3:$XFD$3,)+0)=0,\"\",IFERROR(INDEX($J$6:$XFD$85,C70,MATCH('Anrechnung erbrachter Leistung'!$B$9,$J$3:$XFD$3,)+0),\"\")),\"\")","v":""},{"$f":"IFERROR(IF(ISBLANK(INDEX($J$6:$XFD$85,C70,MATCH('Anrechnung erbrachter Leistung'!$B$9,$J$3:$XFD$3,)+2)),\"\",IFERROR(INDEX($J$6:$XFD$85,C70,MATCH('Anrechnung erbrachter Leistung'!$B$9,$J$3:$XFD$3,)+2),\"\")),\"\")","v":""},null,null,65]
[null,null,66,{"$f":"IFERROR(IF(INDEX($J$6:$XFD$85,C71,MATCH('Anrechnung erbrachter Leistung'!$B$9,$J$3:$XFD$3,)+1)=0,\"\",IFERROR(INDEX($J$6:$XFD$85,C71,MATCH('Anrechnung erbrachter Leistung'!$B$9,$J$3:$XFD$3,)+1),\"\")),\"\")","v":""},{"$f":"IFERROR(IF(INDEX($J$6:$XFD$85,C71,MATCH('Anrechnung erbrachter Leistung'!$B$9,$J$3:$XFD$3,)+0)=0,\"\",IFERROR(INDEX($J$6:$XFD$85,C71,MATCH('Anrechnung erbrachter Leistung'!$B$9,$J$3:$XFD$3,)+0),\"\")),\"\")","v":""},{"$f":"IFERROR(IF(ISBLANK(INDEX($J$6:$XFD$85,C71,MATCH('Anrechnung erbrachter Leistung'!$B$9,$J$3:$XFD$3,)+2)),\"\",IFERROR(INDEX($J$6:$XFD$85,C71,MATCH('Anrechnung erbrachter Leistung'!$B$9,$J$3:$XFD$3,)+2),\"\")),\"\")","v":""},null,null,66]
[null,null,67,{"$f":"IFERROR(IF(INDEX($J$6:$XFD$85,C72,MATCH('Anrechnung erbrachter Leistung'!$B$9,$J$3:$XFD$3,)+1)=0,\"\",IFERROR(INDEX($J$6:$XFD$85,C72,MATCH('Anrechnung erbrachter Leistung'!$B$9,$J$3:$XFD$3,)+1),\"\")),\"\")","v":""},{"$f":"IFERROR(IF(INDEX($J$6:$XFD$85,C72,MATCH('Anrechnung erbrachter Leistung'!$B$9,$J$3:$XFD$3,)+0)=0,\"\",IFERROR(INDEX($J$6:$XFD$85,C72,MATCH('Anrechnung erbrachter Leistung'!$B$9,$J$3:$XFD$3,)+0),\"\")),\"\")","v":""},{"$f":"IFERROR(IF(ISBLANK(INDEX($J$6:$XFD$85,C72,MATCH('Anrechnung erbrachter Leistung'!$B$9,$J$3:$XFD$3,)+2)),\"\",IFERROR(INDEX($J$6:$XFD$85,C72,MATCH('Anrechnung erbrachter Leistung'!$B$9,$J$3:$XFD$3,)+2),\"\")),\"\")","v":""},null,null,67]
[null,null,68,{"$f":"IFERROR(IF(INDEX($J$6:$XFD$85,C73,MATCH('Anrechnung erbrachter Leistung'!$B$9,$J$3:$XFD$3,)+1)=0,\"\",IFERROR(INDEX($J$6:$XFD$85,C73,MATCH('Anrechnung erbrachter Leistung'!$B$9,$J$3:$XFD$3,)+1),\"\")),\"\")","v":""},{"$f":"IFERROR(IF(INDEX($J$6:$XFD$85,C73,MATCH('Anrechnung erbrachter Leistung'!$B$9,$J$3:$XFD$3,)+0)=0,\"\",IFERROR(INDEX($J$6:$XFD$85,C73,MATCH('Anrechnung erbrachter Leistung'!$B$9,$J$3:$XFD$3,)+0),\"\")),\"\")","v":""},{"$f":"IFERROR(IF(ISBLANK(INDEX($J$6:$XFD$85,C73,MATCH('Anrechnung erbrachter Leistung'!$B$9,$J$3:$XFD$3,)+2)),\"\",IFERROR(INDEX($J$6:$XFD$85,C73,MATCH('Anrechnung erbrachter Leistung'!$B$9,$J$3:$XFD$3,)+2),\"\")),\"\")","v":""},null,null,68]
[null,null,69,{"$f":"IFERROR(IF(INDEX($J$6:$XFD$85,C74,MATCH('Anrechnung erbrachter Leistung'!$B$9,$J$3:$XFD$3,)+1)=0,\"\",IFERROR(INDEX($J$6:$XFD$85,C74,MATCH('Anrechnung erbrachter Leistung'!$B$9,$J$3:$XFD$3,)+1),\"\")),\"\")","v":""},{"$f":"IFERROR(IF(INDEX($J$6:$XFD$85,C74,MATCH('Anrechnung erbrachter Leistung'!$B$9,$J$3:$XFD$3,)+0)=0,\"\",IFERROR(INDEX($J$6:$XFD$85,C74,MATCH('Anrechnung erbrachter Leistung'!$B$9,$J$3:$XFD$3,)+0),\"\")),\"\")","v":""},{"$f":"IFERROR(IF(ISBLANK(INDEX($J$6:$XFD$85,C74,MATCH('Anrechnung erbrachter Leistung'!$B$9,$J$3:$XFD$3,)+2)),\"\",IFERROR(INDEX($J$6:$XFD$85,C74,MATCH('Anrechnung erbrachter Leistung'!$B$9,$J$3:$XFD$3,)+2),\"\")),\"\")","v":""},null,null,69]
[null,null,70,{"$f":"IFERROR(IF(INDEX($J$6:$XFD$85,C75,MATCH('Anrechnung erbrachter Leistung'!$B$9,$J$3:$XFD$3,)+1)=0,\"\",IFERROR(INDEX($J$6:$XFD$85,C75,MATCH('Anrechnung erbrachter Leistung'!$B$9,$J$3:$XFD$3,)+1),\"\")),\"\")","v":""},{"$f":"IFERROR(IF(INDEX($J$6:$XFD$85,C75,MATCH('Anrechnung erbrachter Leistung'!$B$9,$J$3:$XFD$3,)+0)=0,\"\",IFERROR(INDEX($J$6:$XFD$85,C75,MATCH('Anrechnung erbrachter Leistung'!$B$9,$J$3:$XFD$3,)+0),\"\")),\"\")","v":""},{"$f":"IFERROR(IF(ISBLANK(INDEX($J$6:$XFD$85,C75,MATCH('Anrechnung erbrachter Leistung'!$B$9,$J$3:$XFD$3,)+2)),\"\",IFERROR(INDEX($J$6:$XFD$85,C75,MATCH('Anrechnung erbrachter Leistung'!$B$9,$J$3:$XFD$3,)+2),\"\")),\"\")","v":""},null,null,70]
[null,null,71,{"$f":"IFERROR(IF(INDEX($J$6:$XFD$85,C76,MATCH('Anrechnung erbrachter Leistung'!$B$9,$J$3:$XFD$3,)+1)=0,\"\",IFERROR(INDEX($J$6:$XFD$85,C76,MATCH('Anrechnung erbrachter Leistung'!$B$9,$J$3:$XFD$3,)+1),\"\")),\"\")","v":""},{"$f":"IFERROR(IF(INDEX($J$6:$XFD$85,C76,MATCH('Anrechnung erbrachter Leistung'!$B$9,$J$3:$XFD$3,)+0)=0,\"\",IFERROR(INDEX($J$6:$XFD$85,C76,MATCH('Anrechnung erbrachter Leistung'!$B$9,$J$3:$XFD$3,)+0),\"\")),\"\")","v":""},{"$f":"IFERROR(IF(ISBLANK(INDEX($J$6:$XFD$85,C76,MATCH('Anrechnung erbrachter Leistung'!$B$9,$J$3:$XFD$3,)+2)),\"\",IFERROR(INDEX($J$6:$XFD$85,C76,MATCH('Anrechnung erbrachter Leistung'!$B$9,$J$3:$XFD$3,)+2),\"\")),\"\")","v":""},null,null,71]
[null,null,72,{"$f":"IFERROR(IF(INDEX($J$6:$XFD$85,C77,MATCH('Anrechnung erbrachter Leistung'!$B$9,$J$3:$XFD$3,)+1)=0,\"\",IFERROR(INDEX($J$6:$XFD$85,C77,MATCH('Anrechnung erbrachter Leistung'!$B$9,$J$3:$XFD$3,)+1),\"\")),\"\")","v":""},{"$f":"IFERROR(IF(INDEX($J$6:$XFD$85,C77,MATCH('Anrechnung erbrachter Leistung'!$B$9,$J$3:$XFD$3,)+0)=0,\"\",IFERROR(INDEX($J$6:$XFD$85,C77,MATCH('Anrechnung erbrachter Leistung'!$B$9,$J$3:$XFD$3,)+0),\"\")),\"\")","v":""},{"$f":"IFERROR(IF(ISBLANK(INDEX($J$6:$XFD$85,C77,MATCH('Anrechnung erbrachter Leistung'!$B$9,$J$3:$XFD$3,)+2)),\"\",IFERROR(INDEX($J$6:$XFD$85,C77,MATCH('Anrechnung erbrachter Leistung'!$B$9,$J$3:$XFD$3,)+2),\"\")),\"\")","v":""},null,null,72]
[null,null,73,{"$f":"IFERROR(IF(INDEX($J$6:$XFD$85,C78,MATCH('Anrechnung erbrachter Leistung'!$B$9,$J$3:$XFD$3,)+1)=0,\"\",IFERROR(INDEX($J$6:$XFD$85,C78,MATCH('Anrechnung erbrachter Leistung'!$B$9,$J$3:$XFD$3,)+1),\"\")),\"\")","v":""},{"$f":"IFERROR(IF(INDEX($J$6:$XFD$85,C78,MATCH('Anrechnung erbrachter Leistung'!$B$9,$J$3:$XFD$3,)+0)=0,\"\",IFERROR(INDEX($J$6:$XFD$85,C78,MATCH('Anrechnung erbrachter Leistung'!$B$9,$J$3:$XFD$3,)+0),\"\")),\"\")","v":""},{"$f":"IFERROR(IF(ISBLANK(INDEX($J$6:$XFD$85,C78,MATCH('Anrechnung erbrachter Leistung'!$B$9,$J$3:$XFD$3,)+2)),\"\",IFERROR(INDEX($J$6:$XFD$85,C78,MATCH('Anrechnung erbrachter Leistung'!$B$9,$J$3:$XFD$3,)+2),\"\")),\"\")","v":""},null,null,73]
[null,null,74,{"$f":"IFERROR(IF(INDEX($J$6:$XFD$85,C79,MATCH('Anrechnung erbrachter Leistung'!$B$9,$J$3:$XFD$3,)+1)=0,\"\",IFERROR(INDEX($J$6:$XFD$85,C79,MATCH('Anrechnung erbrachter Leistung'!$B$9,$J$3:$XFD$3,)+1),\"\")),\"\")","v":""},{"$f":"IFERROR(IF(INDEX($J$6:$XFD$85,C79,MATCH('Anrechnung erbrachter Leistung'!$B$9,$J$3:$XFD$3,)+0)=0,\"\",IFERROR(INDEX($J$6:$XFD$85,C79,MATCH('Anrechnung erbrachter Leistung'!$B$9,$J$3:$XFD$3,)+0),\"\")),\"\")","v":""},{"$f":"IFERROR(IF(ISBLANK(INDEX($J$6:$XFD$85,C79,MATCH('Anrechnung erbrachter Leistung'!$B$9,$J$3:$XFD$3,)+2)),\"\",IFERROR(INDEX($J$6:$XFD$85,C79,MATCH('Anrechnung erbrachter Leistung'!$B$9,$J$3:$XFD$3,)+2),\"\")),\"\")","v":""},null,null,74]
[null,null,75,{"$f":"IFERROR(IF(INDEX($J$6:$XFD$85,C80,MATCH('Anrechnung erbrachter Leistung'!$B$9,$J$3:$XFD$3,)+1)=0,\"\",IFERROR(INDEX($J$6:$XFD$85,C80,MATCH('Anrechnung erbrachter Leistung'!$B$9,$J$3:$XFD$3,)+1),\"\")),\"\")","v":""},{"$f":"IFERROR(IF(INDEX($J$6:$XFD$85,C80,MATCH('Anrechnung erbrachter Leistung'!$B$9,$J$3:$XFD$3,)+0)=0,\"\",IFERROR(INDEX($J$6:$XFD$85,C80,MATCH('Anrechnung erbrachter Leistung'!$B$9,$J$3:$XFD$3,)+0),\"\")),\"\")","v":""},{"$f":"IFERROR(IF(ISBLANK(INDEX($J$6:$XFD$85,C80,MATCH('Anrechnung erbrachter Leistung'!$B$9,$J$3:$XFD$3,)+2)),\"\",IFERROR(INDEX($J$6:$XFD$85,C80,MATCH('Anrechnung erbrachter Leistung'!$B$9,$J$3:$XFD$3,)+2),\"\")),\"\")","v":""},null,null,75]
[null,null,76,{"$f":"IFERROR(IF(INDEX($J$6:$XFD$85,C81,MATCH('Anrechnung erbrachter Leistung'!$B$9,$J$3:$XFD$3,)+1)=0,\"\",IFERROR(INDEX($J$6:$XFD$85,C81,MATCH('Anrechnung erbrachter Leistung'!$B$9,$J$3:$XFD$3,)+1),\"\")),\"\")","v":""},{"$f":"IFERROR(IF(INDEX($J$6:$XFD$85,C81,MATCH('Anrechnung erbrachter Leistung'!$B$9,$J$3:$XFD$3,)+0)=0,\"\",IFERROR(INDEX($J$6:$XFD$85,C81,MATCH('Anrechnung erbrachter Leistung'!$B$9,$J$3:$XFD$3,)+0),\"\")),\"\")","v":""},{"$f":"IFERROR(IF(ISBLANK(INDEX($J$6:$XFD$85,C81,MATCH('Anrechnung erbrachter Leistung'!$B$9,$J$3:$XFD$3,)+2)),\"\",IFERROR(INDEX($J$6:$XFD$85,C81,MATCH('Anrechnung erbrachter Leistung'!$B$9,$J$3:$XFD$3,)+2),\"\")),\"\")","v":""},null,null,76]
[null,null,77,{"$f":"IFERROR(IF(INDEX($J$6:$XFD$85,C82,MATCH('Anrechnung erbrachter Leistung'!$B$9,$J$3:$XFD$3,)+1)=0,\"\",IFERROR(INDEX($J$6:$XFD$85,C82,MATCH('Anrechnung erbrachter Leistung'!$B$9,$J$3:$XFD$3,)+1),\"\")),\"\")","v":""},{"$f":"IFERROR(IF(INDEX($J$6:$XFD$85,C82,MATCH('Anrechnung erbrachter Leistung'!$B$9,$J$3:$XFD$3,)+0)=0,\"\",IFERROR(INDEX($J$6:$XFD$85,C82,MATCH('Anrechnung erbrachter Leistung'!$B$9,$J$3:$XFD$3,)+0),\"\")),\"\")","v":""},{"$f":"IFERROR(IF(ISBLANK(INDEX($J$6:$XFD$85,C82,MATCH('Anrechnung erbrachter Leistung'!$B$9,$J$3:$XFD$3,)+2)),\"\",IFERROR(INDEX($J$6:$XFD$85,C82,MATCH('Anrechnung erbrachter Leistung'!$B$9,$J$3:$XFD$3,)+2),\"\")),\"\")","v":""},null,null,77]
[null,null,78,{"$f":"IFERROR(IF(INDEX($J$6:$XFD$85,C83,MATCH('Anrechnung erbrachter Leistung'!$B$9,$J$3:$XFD$3,)+1)=0,\"\",IFERROR(INDEX($J$6:$XFD$85,C83,MATCH('Anrechnung erbrachter Leistung'!$B$9,$J$3:$XFD$3,)+1),\"\")),\"\")","v":""},{"$f":"IFERROR(IF(INDEX($J$6:$XFD$85,C83,MATCH('Anrechnung erbrachter Leistung'!$B$9,$J$3:$XFD$3,)+0)=0,\"\",IFERROR(INDEX($J$6:$XFD$85,C83,MATCH('Anrechnung erbrachter Leistung'!$B$9,$J$3:$XFD$3,)+0),\"\")),\"\")","v":""},{"$f":"IFERROR(IF(ISBLANK(INDEX($J$6:$XFD$85,C83,MATCH('Anrechnung erbrachter Leistung'!$B$9,$J$3:$XFD$3,)+2)),\"\",IFERROR(INDEX($J$6:$XFD$85,C83,MATCH('Anrechnung erbrachter Leistung'!$B$9,$J$3:$XFD$3,)+2),\"\")),\"\")","v":""},null,null,78]
[null,null,79,{"$f":"IFERROR(IF(INDEX($J$6:$XFD$85,C84,MATCH('Anrechnung erbrachter Leistung'!$B$9,$J$3:$XFD$3,)+1)=0,\"\",IFERROR(INDEX($J$6:$XFD$85,C84,MATCH('Anrechnung erbrachter Leistung'!$B$9,$J$3:$XFD$3,)+1),\"\")),\"\")","v":""},{"$f":"IFERROR(IF(INDEX($J$6:$XFD$85,C84,MATCH('Anrechnung erbrachter Leistung'!$B$9,$J$3:$XFD$3,)+0)=0,\"\",IFERROR(INDEX($J$6:$XFD$85,C84,MATCH('Anrechnung erbrachter Leistung'!$B$9,$J$3:$XFD$3,)+0),\"\")),\"\")","v":""},{"$f":"IFERROR(IF(ISBLANK(INDEX($J$6:$XFD$85,C84,MATCH('Anrechnung erbrachter Leistung'!$B$9,$J$3:$XFD$3,)+2)),\"\",IFERROR(INDEX($J$6:$XFD$85,C84,MATCH('Anrechnung erbrachter Leistung'!$B$9,$J$3:$XFD$3,)+2),\"\")),\"\")","v":""},null,null,79]
[null,null,80,{"$f":"IFERROR(IF(INDEX($J$6:$XFD$85,C85,MATCH('Anrechnung erbrachter Leistung'!$B$9,$J$3:$XFD$3,)+1)=0,\"\",IFERROR(INDEX($J$6:$XFD$85,C85,MATCH('Anrechnung erbrachter Leistung'!$B$9,$J$3:$XFD$3,)+1),\"\")),\"\")","v":""},{"$f":"IFERROR(IF(INDEX($J$6:$XFD$85,C85,MATCH('Anrechnung erbrachter Leistung'!$B$9,$J$3:$XFD$3,)+0)=0,\"\",IFERROR(INDEX($J$6:$XFD$85,C85,MATCH('Anrechnung erbrachter Leistung'!$B$9,$J$3:$XFD$3,)+0),\"\")),\"\")","v":""},{"$f":"IFERROR(IF(ISBLANK(INDEX($J$6:$XFD$85,C85,MATCH('Anrechnung erbrachter Leistung'!$B$9,$J$3:$XFD$3,)+2)),\"\",IFERROR(INDEX($J$6:$XFD$85,C85,MATCH('Anrechnung erbrachter Leistung'!$B$9,$J$3:$XFD$3,)+2),\"\")),\"\")","v":""},null,null,80]

{"sheet":"Begründung","index":2,"n_rows":23,"n_cols":17,"rows_kept":23,"cut":false,"hidden":true,"merged":[[22,1,25,14],[2,1,2,14],[3,1,3,14],[4,1,6,1],[4,2,6,14],[7,1,9,1],[7,2,9,14],[19,1,21,1],[19,2,21,14],[10,1,12,1],[10,2,12,14],[13,1,15,1],[13,2,15,14],[16,1,18,1],[16,2,18,14]]}
[]
[null,"Nur vom Prüfungsamt auszufüllen!"]
[null,"Begründung/Bemerkung zu",null,null,null,null,null,null,null,null,null,null,null,null,null,null,{"$f":"IFERROR(VLOOKUP(P3,Studiengänge!$D$5:$F$32,3),\"\")","v":""}]
[null,"Prüfungsnr./ Modul",null,null,null,null,null,null,null,null,null,null,null,null,null,null,{"$f":"IFERROR(VLOOKUP(P4,Studiengänge!$D$5:$F$32,3),\"\")","v":""}]
[null,{"$f":"IFERROR(VLOOKUP(#REF!,Studiengänge!$D$6:$F$85,2,0),\"\")","v":""},{"$f":"IFERROR(VLOOKUP(#REF!,Studiengänge!$D$6:$F$85,3,0),\"\")","v":""},null,null,null,null,null,null,null,null,null,null,null,null,null,{"$f":"IFERROR(VLOOKUP(P5,Studiengänge!$D$5:$F$32,3),\"\")","v":""}]
[null,null,null,null,null,null,null,null,null,null,null,null,null,null,null,null,{"$f":"IFERROR(VLOOKUP(P6,Studiengänge!$D$5:$F$32,3),\"\")","v":""}]
[null,null,null,null,null,null,null,null,null,null,null,null,null,null,null,null,{"$f":"IFERROR(VLOOKUP(P7,Studiengänge!$D$5:$F$32,3),\"\")","v":""}]
[null,{"$f":"IFERROR(VLOOKUP(#REF!,Studiengänge!$D$6:$F$85,2,0),\"\")","v":""},{"$f":"IFERROR(VLOOKUP(#REF!,Studiengänge!$D$6:$F$85,3,0),\"\")","v":""},null,null,null,null,null,null,null,null,null,null,null,null,null,{"$f":"IFERROR(VLOOKUP(P8,Studiengänge!$D$5:$F$32,3),\"\")","v":""}]
[null,null,null,null,null,null,null,null,null,null,null,null,null,null,null,null,{"$f":"IFERROR(VLOOKUP(P9,Studiengänge!$D$5:$F$32,3),\"\")","v":""}]
[null,null,null,null,null,null,null,null,null,null,null,null,null,null,null,null,{"$f":"IFERROR(VLOOKUP(P10,Studiengänge!$D$5:$F$32,3),\"\")","v":""}]
[null,{"$f":"IFERROR(VLOOKUP(#REF!,Studiengänge!$D$6:$F$85,2,0),\"\")","v":""},{"$f":"IFERROR(VLOOKUP(#REF!,Studiengänge!$D$6:$F$85,3,0),\"\")","v":""}]
[]
[]
[null,{"$f":"IFERROR(VLOOKUP(#REF!,Studiengänge!$D$6:$F$85,2,0),\"\")","v":""},{"$f":"IFERROR(VLOOKUP(#REF!,Studiengänge!$D$6:$F$85,3,0),\"\")","v":""}]
[]
[]
[null,{"$f":"IFERROR(VLOOKUP(#REF!,Studiengänge!$D$6:$F$85,2,0),\"\")","v":""},{"$f":"IFERROR(VLOOKUP(#REF!,Studiengänge!$D$6:$F$85,3,0),\"\")","v":""}]
[]
[]
[null,{"$f":"IFERROR(VLOOKUP(#REF!,Studiengänge!$D$6:$F$85,2,0),\"\")","v":""},{"$f":"IFERROR(VLOOKUP(#REF!,Studiengänge!$D$6:$F$85,3,0),\"\")","v":""}]
[]
[]
[null,"Rechtsbehelfsbelehrung:\nGegen diese Entscheidung kann innerhalb eines Monats nach Bekanntgabe Widerspruch erhoben werden. Der Widerspruch ist bei der \nFH Münster, Hüfferstraße 27, 48149 Münster schriftlich oder zur Niederschrift einzulegen. Falls die Frist durch das Verschulden eines Bevollmächtigten versäumt werden sollte, würde dessen Verschulden Ihnen zugerechnet werden."]